Aprobarbital

Van Den Dool and Kratz RI, non-polar column, custom temperature program

Data compiled by: NIST Mass Spectrometry Data Center, William E. Wallace, director

Column type Capillary
Active phase CP Sil 5 CB
Column length (m) 10.
Carrier gas He
Substrate
Column diameter (mm) 0.53
Phase thickness (μm) 5.0
Program 100 0C (2 min ) 15 0C/min -> 200 0C 10 0C/min -> 300 0C (8 min hold)
I 1619.
ReferenceAderjan and Bogusz, 1988
Comment MSDC-RI

References

Aderjan and Bogusz, 1988
Aderjan, R.; Bogusz, M., Nitroalkanes as a multidetector retention index scale for drug identification in gas chromatography, J. Chromatogr., 1988, 454, 345-351, https://doi.org/10.1016/S0021-9673(00)88629-X . [all data]