Phosphorodichloridic acid, phenyl ester

Phase change data

Data compiled as indicated in comments:
AC - William E. Acree, Jr., James S. Chickos

Enthalpy of vaporization

ΔvapH (kJ/mol) Temperature (K) Method Reference Comment
63.6354.AStephenson and Malanowski, 1987Based on data from 339. - 513. K. See also Stull, 1947.; AC

Antoine Equation Parameters

log10(P) = A − (B / (T + C))
    P = vapor pressure (bar)
    T = temperature (K)

View plot Requires a JavaScript / HTML 5 canvas capable browser.

Temperature (K) A B C Reference Comment
339.8 - 512.74.961262318.503-44.118Stull, 1947Coefficents calculated by NIST from author's data.

Gas phase ion energetics data

Data compiled by: Sharon G. Lias, Rhoda D. Levin, and Sherif A. Kafafi

Ionization energy determinations

IE (eV) Method Reference
9.1PEZverev, Vilesov, et al., 1975

References

Stephenson and Malanowski, 1987
Stephenson, Richard M.; Malanowski, Stanislaw, Handbook of the Thermodynamics of Organic Compounds, 1987, https://doi.org/10.1007/978-94-009-3173-2 . [all data]

Stull, 1947
Stull, Daniel R., Vapor Pressure of Pure Substances. Organic and Inorganic Compounds, Ind. Eng. Chem., 1947, 39, 4, 517-540, https://doi.org/10.1021/ie50448a022 . [all data]

Zverev, Vilesov, et al., 1975
Zverev, V.V.; Vilesov, F.I.; Vovna, V.I.; Lopatin, S.N.; Kitaev, Y.P., Photoelectron spectra, Izv. Akad. Nauk SSSR, Ser. Khim., 1975, 1975, 1051. [all data]