Methadone

Normal alkane RI, non-polar column, temperature ramp

Data compiled by: NIST Mass Spectrometry Data Center, William E. Wallace, director

Column type CapillaryCapillaryCapillaryCapillaryPacked
Active phase DB-5BP-1BP-1BP-1SE-30
Column length (m) 15.12.12.12.2.
Carrier gas HeHeHeHeNitrogen
Substrate     Chromosorb W AW DMS (80-100 mesh)
Column diameter (mm) 0.250.220.220.22
Phase thickness (μm) 0.20.250.250.25
Tstart (C) 185.100.120.50.130.
Tend (C) 270.295.280.300.290.
Heat rate (K/min) 10.5.8.20.8.
Initial hold (min)     2.
Final hold (min)     8.
I 2121.2121.2131.2135.2140.
ReferencePhillips, Logan, et al., 1990Stowell and Wilson, 1985Stowell and Wilson, 1985Stowell and Wilson, 1985Peel and Perrigo, 1976
Comment MSDC-RI MSDC-RI MSDC-RI MSDC-RI MSDC-RI
Column type Packed
Active phase SE-30
Column length (m) 2.
Carrier gas N2
Substrate Chromosorb W AW DMS
Column diameter (mm)
Phase thickness (μm)
Tstart (C) 130.
Tend (C) 290.
Heat rate (K/min) 8.
Initial hold (min) 2.
Final hold (min) 8.
I 2140.
ReferencePeel and Perrigo, 1975
Comment MSDC-RI

Van Den Dool and Kratz RI, non-polar column, temperature ramp

Data compiled by: NIST Mass Spectrometry Data Center, William E. Wallace, director

Column type CapillaryCapillaryCapillaryCapillaryCapillary
Active phase VF-5MSSPB-1SPB-1DB-1Methyl Silicone
Column length (m) 30.30.30.15.12.
Carrier gas HeHeHeHeHe
Substrate
Column diameter (mm) 0.250.750.750.320.2
Phase thickness (μm) 0.251.01.00.250.33
Tstart (C) 60.160.160.120.50.
Tend (C) 270.280.280.280.300.
Heat rate (K/min)  10.10.8.20.
Initial hold (min)     1.
Final hold (min)  12.12.5.3.
I 2182.12141.2109.2131.2135.0
ReferenceTretyakov, 2014Christ, Noomano, et al., 1988Christ, Noomano, et al., 1988Perrigo, Peel, et al., 1985Newton and Foery, 1984
Comment MSDC-RI MSDC-RI MSDC-RI MSDC-RI MSDC-RI
Column type CapillaryCapillaryCapillaryPacked
Active phase 5 % Phenyl methyl siloxaneDB-1SE-30SE-30
Column length (m) 12.15.15.1.8
Carrier gas HeHeHeN2
Substrate    Chromosorb W
Column diameter (mm) 0.20.250.25
Phase thickness (μm) 0.330.250.25
Tstart (C) 50.120.100.130.
Tend (C) 300.280.295.290.
Heat rate (K/min) 20.8.5.8.
Initial hold (min) 1.  2.
Final hold (min) 3.5. 8.
I 2185.02131.2121.2140.
ReferenceNewton and Foery, 1984Perrigo, Ballantyne, et al., 1984Anderson and Stafford, 1983Perrigo and Peel, 1981
Comment MSDC-RI MSDC-RI MSDC-RI MSDC-RI

References

Phillips, Logan, et al., 1990
Phillips, A.M.; Logan, B.K.; Stafford, D.T., Further applications for capillary gas chromatography in routine quantitative toxicological analyses, J. Hi. Res. Chromatogr., 1990, 13, 11, 754-758, https://doi.org/10.1002/jhrc.1240131106 . [all data]

Stowell and Wilson, 1985
Stowell, A.; Wilson, L., Use of retention indices in drug screening by capillary gas chromatography, Rep. # CD 2362, Department of Scientific and Industrial Reseach, Chemistry Division, Lower Hutt, NZ, 1985, 32. [all data]

Peel and Perrigo, 1976
Peel, H.W.; Perrigo, B., A practical gas chromatographic screening procedure for toxicological analysis, Can. Soc. Forens. Sci. J., 1976, 9, 2, 69-74, https://doi.org/10.1080/00085030.1976.10757247 . [all data]

Peel and Perrigo, 1975
Peel, H.W.; Perrigo, B., A practical gas chromatographic screening procedure for toxicological analysis, Can.Soc.Forens.Sci.J., 1975, 9, 2, 69-74, https://doi.org/10.1080/00085030.1976.10757247 . [all data]