2,4,6-Trimethylphenylacetylene

Gas phase ion energetics data

Data compiled as indicated in comments:
LLK - Sharon G. Lias, Rhoda D. Levin, and Sherif A. Kafafi

Ionization energy determinations

IE (eV) Method Reference Comment
8.16 ± 0.08PEElbel, Lienert, et al., 1981LLK

References

Elbel, Lienert, et al., 1981
Elbel, S.; Lienert, K.; Krebs, A.; tom Dieck, H., Phenylethin - mustersonde fur substituenteneffekte, Liebigs Ann. Chem., 1981, 1785. [all data]