Amantadine

Phase change data

Data compiled by: William E. Acree, Jr., James S. Chickos

Quantity Value Units Method Reference Comment
Δsub61.7 ± 0.6kJ/molME,GSBazyleva, Blokhin, et al., 2008Based on data from 291. - 343. K.

References

Bazyleva, Blokhin, et al., 2008
Bazyleva, Ala B.; Blokhin, Andrey V.; Kabo, Andrey G.; Kabo, Gennady J.; Emel'yanenko, Vladimir N.; Verevkin, Sergey P., Thermodynamic properties of 1-aminoadamantane, The Journal of Chemical Thermodynamics, 2008, 40, 3, 509-522, https://doi.org/10.1016/j.jct.2007.08.002 . [all data]