1-Fluoroadamantane

Kovats' RI, non-polar column, isothermal

Data compiled by: NIST Mass Spectrometry Data Center, William E. Wallace, director

Column type PackedCapillaryCapillaryCapillaryCapillary
Active phase SE-30SE-30SE-30SE-30SE-30
Column length (m) 1.50.50.50.50.
Carrier gas N2N2N2N2N2
Substrate N-AW Chromaton
Column diameter (mm)  0.270.270.270.27
Phase thickness (μm)
Temperature (C) 150.145.160.175.190.
I 1159.1159.1174.1184.1196.
ReferenceL'vova, Kurbatova, et al., 2001Burkhard, Vais, et al., 1969Burkhard, Vais, et al., 1969Burkhard, Vais, et al., 1969Burkhard, Vais, et al., 1969
Comment MSDC-RI MSDC-RI MSDC-RI MSDC-RI MSDC-RI

Kovats' RI, polar column, isothermal

Data compiled by: NIST Mass Spectrometry Data Center, William E. Wallace, director

Column type PackedCapillaryCapillaryCapillary
Active phase Carbowax 20MCarbowax 20MCarbowax 20MCarbowax 20M
Column length (m) 1.50.50.50.
Carrier gas N2N2N2N2
Substrate N-AW Chromaton
Column diameter (mm)  0.270.270.27
Phase thickness (μm)
Temperature (C) 150.145.160.175.
I 1512.1512.1534.1557.
ReferenceL'vova, Kurbatova, et al., 2001Burkhard, Vais, et al., 1969Burkhard, Vais, et al., 1969Burkhard, Vais, et al., 1969
Comment MSDC-RI MSDC-RI MSDC-RI MSDC-RI

Normal alkane RI, non-polar column, custom temperature program

Data compiled by: NIST Mass Spectrometry Data Center, William E. Wallace, director

Column type CapillaryCapillary
Active phase Polydimethyl siloxanePolydimethyl siloxane
Column length (m)
Carrier gas
Substrate
Column diameter (mm)
Phase thickness (μm)
Program not specifiednot specified
I 1159.1159.
ReferenceBayat and Abad, 2011Bayat and Abad M.F.Y., 2011
Comment MSDC-RI MSDC-RI

References

L'vova, Kurbatova, et al., 2001
L'vova, N.Yu.; Kurbatova, S.V.; Yashkin, S.N.; Kolosova, E.A., Gas chromatography of halogenated adamantanes, Russ. J. Phys. Chem. (Engl. Transl.), 2001, 75, 12, 2053-2056. [all data]

Burkhard, Vais, et al., 1969
Burkhard, J.; Vais, J.; Vodicka, L.; Landa, S., Adamantane and its derivatives. XVI. The gas chromatographic characterization of adamantane derivatives, J. Chromatogr., 1969, 42, 207-218, https://doi.org/10.1016/S0021-9673(01)80617-8 . [all data]