Silane, chlorotriphenyl-

Condensed phase thermochemistry data

Data compiled by: Eugene S. Domalski and Elizabeth D. Hearing

Quantity Value Units Method Reference Comment
solid,1 bar370.0J/mol*KN/AKostryukov, Mosin, et al., 1968

Constant pressure heat capacity of solid

Cp,solid (J/mol*K) Temperature (K) Reference Comment
337.6298.15Kostryukov, Mosin, et al., 1968T = 12.39 to 386.93 K.

Phase change data

Data compiled as indicated in comments:
BS - Robert L. Brown and Stephen E. Stein
TRC - Thermodynamics Research Center, NIST Boulder Laboratories, Chris Muzny director
DH - Eugene S. Domalski and Elizabeth D. Hearing
AC - William E. Acree, Jr., James S. Chickos

Quantity Value Units Method Reference Comment
Tfus362.15KN/AHance and Hauser, 1952Uncertainty assigned by TRC = 1.5 K; TRC
Quantity Value Units Method Reference Comment
Ttriple370.6KN/AKostryukov, Mosin, et al., 1968, 2Uncertainty assigned by TRC = 0.2 K; TRC

Reduced pressure boiling point

Tboil (K) Pressure (bar) Reference Comment
483.0.013PCR Inc., 1990BS

Enthalpy of fusion

ΔfusH (kJ/mol) Temperature (K) Reference Comment
26.878370.6Kostryukov, Mosin, et al., 1968DH
26.88370.6Domalski and Hearing, 1996AC

Entropy of fusion

ΔfusS (J/mol*K) Temperature (K) Reference Comment
72.53370.6Kostryukov, Mosin, et al., 1968DH

In addition to the Thermodynamics Research Center (TRC) data available from this site, much more physical and chemical property data is available from the following TRC products:

Kovats' RI, non-polar column, isothermal

View large format table.

Column type Active phase Temperature (C) I Reference Comment
PackedPolymethylsiloxane, (PMS-20000)50.2191.Ainshtein and Shulyatieva, 1972He, Chromosorb W; Column length: 2. m

References

Kostryukov, Mosin, et al., 1968
Kostryukov, V.N.; Mosin, A.M.; Samorukov, O.P.; Shlyakova, V.G., Thermodynamics of triphenylchlorosilane at low temperatures, Russ. J. Phys. Chem., 1968, 42, 968-970. [all data]

Hance and Hauser, 1952
Hance, C.R.; Hauser, C.R., Cleavage of Tetraphenylsiland and Benzyltriphenylsilane by Potassium Amide, J. Am. Chem. Soc., 1952, 74, 1856. [all data]

Kostryukov, Mosin, et al., 1968, 2
Kostryukov, V.N.; Mosin, A.M.; Samorukov, O.P.; Shlyakova, V.G., Thermpdynamics of triphenylchlorosilane at low temperatures, Russ. J. Phys. Chem. (Engl. Transl.), 1968, 42, 968-70. [all data]

PCR Inc., 1990
PCR Inc., Research Chemicals Catalog 1990-1991, PCR Inc., Gainesville, FL, 1990, 1. [all data]

Domalski and Hearing, 1996
Domalski, Eugene S.; Hearing, Elizabeth D., Heat Capacities and Entropies of Organic Compounds in the Condensed Phase. Volume III, J. Phys. Chem. Ref. Data, 1996, 25, 1, 1, https://doi.org/10.1063/1.555985 . [all data]