1-methyl-4-octylbenzene

Phase change data

Data compiled by: Thermodynamics Research Center, NIST Boulder Laboratories, Chris Muzny director

Quantity Value Units Method Reference Comment
Tfus246.7KN/AShen, Wood, et al., 1939Uncertainty assigned by TRC = 1.5 K

In addition to the Thermodynamics Research Center (TRC) data available from this site, much more physical and chemical property data is available from the following TRC products:

References

Shen, Wood, et al., 1939
Shen, G.; Wood, C.E.; Garner, F.H., J. Inst. Pet., 1939, 25, 695. [all data]