1,5-Dithia-2,4,6,8-tetrazocine, 3,7-diphenyl-

Gas phase ion energetics data

Data compiled by: Sharon G. Lias, John E. Bartmess, Joel F. Liebman, John L. Holmes, Rhoda D. Levin, and W. Gary Mallard

Ionization energy determinations

IE (eV) Method Reference Comment
8.26PEGleiter, Bartetzko, et al., 1984
9.0PEGleiter, Bartetzko, et al., 1984Vertical value

References

Gleiter, Bartetzko, et al., 1984
Gleiter, R.; Bartetzko, R.; Cremer, D., Electronic structure of 1,5-dithia-2,4,6,8-tetrazocine. Model calculations and spectroscopic investigations, J. Am. Chem. Soc., 1984, 106, 3437. [all data]