Iron, compound with vanadium (1:1)

Gas phase ion energetics data

Data compiled as indicated in comments:
LBLHLM - Sharon G. Lias, John E. Bartmess, Joel F. Liebman, John L. Holmes, Rhoda D. Levin, and W. Gary Mallard

Ionization energy determinations

IE (eV) Method Reference Comment
5.4PIHettich and Freiser, 1985LBLHLM

References

Hettich and Freiser, 1985
Hettich, R.; Freiser, B., Heteronuclear transition-metal cluster ions in the gas phase. Photodissociation and reactivity of VFe+, J. Am. Chem. Soc., 1985, 107, 6222. [all data]