Di-n-propyl ketone n-propylhydrazone

Condensed phase thermochemistry data

Data compiled by: Hussein Y. Afeefy, Joel F. Liebman, and Stephen E. Stein

Quantity Value Units Method Reference Comment
Δfliquid-25.60 ± 0.50kcal/molCcbLebedeva, Masalitinova, et al., 1980
Quantity Value Units Method Reference Comment
Δcliquid-1666.4 ± 0.50kcal/molCcbLebedeva, Masalitinova, et al., 1980

References

Lebedeva, Masalitinova, et al., 1980
Lebedeva, N.D.; Masalitinova, T.N.; Ryadnenko, V.L.; Monyakova, O.N., Enthalpies of combustion and formation of alkyl-substituted hydrazones, J. Appl. Chem. USSR, 1980, 53, 1800-1803. [all data]