Acetone di-n-propylhydrazone

Condensed phase thermochemistry data

Data compiled by: Hussein Y. Afeefy, Joel F. Liebman, and Stephen E. Stein

Quantity Value Units Method Reference Comment
Δfliquid-15.2 ± 0.29kcal/molCcbLebedeva, Masalitinova, et al., 1980
Quantity Value Units Method Reference Comment
Δcliquid-1514.4 ± 0.29kcal/molCcbLebedeva, Masalitinova, et al., 1980

References

Lebedeva, Masalitinova, et al., 1980
Lebedeva, N.D.; Masalitinova, T.N.; Ryadnenko, V.L.; Monyakova, O.N., Enthalpies of combustion and formation of alkyl-substituted hydrazones, J. Appl. Chem. USSR, 1980, 53, 1800-1803. [all data]