1-Butylpyrrolidine

Kovats' RI, non-polar column, isothermal

Data compiled by: NIST Mass Spectrometry Data Center, William E. Wallace, director

Column type PackedPacked
Active phase SE-30SE-30
Column length (m) 2.2.
Carrier gas N2N2
Substrate Chromosorb W-AWChromosorb W-AW
Column diameter (mm)
Phase thickness (μm)
Temperature (C) 110.90.
I 954.944.
ReferenceTibor and Anna, 1971Tibor and Anna, 1971
Comment MSDC-RI MSDC-RI

Phase change data

Data compiled by: Robert L. Brown and Stephen E. Stein

Reduced pressure boiling point

Tboil (K) Pressure (atm) Reference
429.20.992Aldrich Chemical Company Inc., 1990

References

Tibor and Anna, 1971
Tibor, T.; Anna, B., Gázkromatográfiás retenció és a kémiai szerkezet, I., Magy. Kem. Foly., 1971, 77, 576-587. [all data]