Hexacontane

Phase change data

Data compiled as indicated in comments:
TRC - Thermodynamics Research Center, NIST Boulder Laboratories, Chris Muzny director
AC - William E. Acree, Jr., James S. Chickos

Quantity Value Units Method Reference Comment
Tfus372.1KN/ACarothers, Hill, et al., 1930Uncertainty assigned by TRC = 2. K; TRC
Tfus375.KN/AFischer and Tropsch, 1927Uncertainty assigned by TRC = 2. K; TRC
Tfus375.KN/AStruve, 1908Uncertainty assigned by TRC = 4. K; TRC
Tfus375.KN/AHell and Haegele, 1889Uncertainty assigned by TRC = 4. K; TRC
Quantity Value Units Method Reference Comment
Δvap71.68 ± 0.48kcal/molCGCChickos, Wang, et al., 2008Based on data from 323. - 523. K.; AC

Enthalpy of vaporization

ΔvapH (kcal/mol) Temperature (K) Method Reference Comment
39.0653.A,EStephenson and Malanowski, 1987Based on data from 638. - 893. K. See also Kudchadker and Zwolinski, 1966.; AC

Enthalpy of fusion

ΔfusH (kcal/mol) Temperature (K) Method Reference Comment
44.65373.2DSCLourdin, Roux, et al., 1992AC

In addition to the Thermodynamics Research Center (TRC) data available from this site, much more physical and chemical property data is available from the following TRC products:

References

Carothers, Hill, et al., 1930
Carothers, W.H.; Hill, J.W.; Kirby, J.E.; Jacobson, R.A., Studies on Polymerization and Ring Formation. VII. Normal Paraffin Hydro- carbons of High Molecular Weight Prepared by the Action of Sodium on Decamethylene Bormide, J. Am. Chem. Soc., 1930, 52, 5279. [all data]

Fischer and Tropsch, 1927
Fischer; Tropsch, Chem. Ber., 1927, 60, 1330. [all data]

Struve, 1908
Struve, K., Justus Leibigs Ann. Chem., 1908, 362, 123. [all data]

Hell and Haegele, 1889
Hell, C.; Haegele, C., Chem. Ber., 1889, 22, 502. [all data]

Chickos, Wang, et al., 2008
Chickos, James; Wang, Tracy; Sharma, Esseim, Hypothetical Thermodynamic Properties: Vapor Pressures and Vaporization Enthalpies of the Even n -Alkanes from C 40 to C 76 at T = 298.15 K by Correlation-Gas Chromatography. Are the Vaporization Enthalpies a Linear Function of Carbon Number?, J. Chem. Eng. Data, 2008, 53, 2, 481-491, https://doi.org/10.1021/je7005852 . [all data]

Stephenson and Malanowski, 1987
Stephenson, Richard M.; Malanowski, Stanislaw, Handbook of the Thermodynamics of Organic Compounds, 1987, https://doi.org/10.1007/978-94-009-3173-2 . [all data]

Kudchadker and Zwolinski, 1966
Kudchadker, A.P.; Zwolinski, B.J., Vapor Pressure and Boiling Points of Normal Alkanes, C 21 to C 100 ., J. Chem. Eng. Data, 1966, 11, 2, 253-255, https://doi.org/10.1021/je60029a039 . [all data]

Lourdin, Roux, et al., 1992
Lourdin, D.; Roux, A.H.; Grolier, J.-P.E.; Buisine, J.-M., Thermobarometric and differential scanning calorimetric study of the polymorphism of some even and odd paraffins (C26, C27, C40, C60), Thermochimica Acta, 1992, 204, 1, 99-110, https://doi.org/10.1016/0040-6031(92)80319-R . [all data]