3-Octen-2-ol

Normal alkane RI, polar column, temperature ramp

Data compiled by: NIST Mass Spectrometry Data Center, William E. Wallace, director

Column type Capillary
Active phase FFAP
Column length (m) 30.
Carrier gas Nitrogen
Substrate
Column diameter (mm) 0.32
Phase thickness (μm) 0.50
Tstart (C) 35.
Tend (C) 250.
Heat rate (K/min) 4.
Initial hold (min) 5.
Final hold (min) 45.
I 1769.
ReferenceBudryn, Nebesny, et al., 2011
Comment MSDC-RI

References

Budryn, Nebesny, et al., 2011
Budryn, G.; Nebesny, E.; Kula, J.; Majda, T.; Krysiak, W., HS-SPME/GC/MS Profiles of convectively and microwave roasted Ivory Coast Robusta coffee brews, Czech. J. Food Sci., 2011, 29, 2, 151-160. [all data]