1,2-Cyclohexanedione

Phase change data

Data compiled by: Robert L. Brown and Stephen E. Stein

Quantity Value Units Method Reference Comment
Tboil467.2KN/AWeast and Grasselli, 1989

Gas phase ion energetics data

Data evaluated by: Edward P. Hunter and Sharon G. Lias

Quantity Value Units Method Reference Comment
Proton affinity (review)203.1kcal/molN/AHunter and Lias, 1998
Quantity Value Units Method Reference Comment
Gas basicity195.7kcal/molN/AHunter and Lias, 1998

Normal alkane RI, polar column, temperature ramp

View large format table.

Column type Active phase I Reference Comment
CapillaryDB-Wax1668.Moon and Shibamoto, 201060. m/0.25 mm/0.50 μm, Helium, 40. C @ 5. min, 2. K/min, 210. C @ 70. min

References

Weast and Grasselli, 1989
CRC Handbook of Data on Organic Compounds, 2nd Editon, Weast,R.C and Grasselli, J.G., ed(s)., CRC Press, Inc., Boca Raton, FL, 1989, 1. [all data]

Hunter and Lias, 1998
Hunter, E.P.; Lias, S.G., Evaluated Gas Phase Basicities and Proton Affinities of Molecules: An Update, J. Phys. Chem. Ref. Data, 1998, 27, 3, 413-656, https://doi.org/10.1063/1.556018 . [all data]

Moon and Shibamoto, 2010
Moon, J.-K.; Shibamoto, T., Formation of volatile chemicals from thermal degradation of less volatile cofee components: quinic acid, caffeic acid, and chlorogenic acid, J. Agric. Food Chem., 2010, 58, 9, 5465-5470, https://doi.org/10.1021/jf1005148 . [all data]