Cyclobutanecarboxylic acid methyl ester

Gas phase thermochemistry data

Data compiled by: Hussein Y. Afeefy, Joel F. Liebman, and Stephen E. Stein

Quantity Value Units Method Reference Comment
Δfgas-350.3 ± 1.3kJ/molCmFuchs and Hallman, 1983
Δfgas-355.3kJ/molCcrHall and Baldt, 1971

Condensed phase thermochemistry data

Data compiled as indicated in comments:
ALS - Hussein Y. Afeefy, Joel F. Liebman, and Stephen E. Stein
DH - Eugene S. Domalski and Elizabeth D. Hearing

Quantity Value Units Method Reference Comment
Δfliquid-395.1kJ/molCcrHall and Baldt, 1971ALS
Quantity Value Units Method Reference Comment
Δcliquid-3395.2 ± 1.3kJ/molCcrHall and Baldt, 1971Corresponding Δfliquid = -395.0 kJ/mol (simple calculation by NIST; no Washburn corrections); ALS

Constant pressure heat capacity of liquid

Cp,liquid (J/mol*K) Temperature (K) Reference Comment
190.6297.Hall and Baldt, 1971DH

Phase change data

Data compiled as indicated in comments:
ALS - Hussein Y. Afeefy, Joel F. Liebman, and Stephen E. Stein
AC - William E. Acree, Jr., James S. Chickos
DRB - Donald R. Burgess, Jr.

Quantity Value Units Method Reference Comment
Δvap44.72 ± 0.09kJ/molCFuchs and Hallman, 1983ALS
Δvap44.7 ± 0.1kJ/molCFuchs and Hallman, 1983AC
Δvap39.7kJ/molVHall and Baldt, 1971ALS
Δvap39.8kJ/molN/AHall and Baldt, 1971DRB

Enthalpy of vaporization

ΔvapH (kJ/mol) Temperature (K) Method Reference Comment
41.4340.BGBaldt and Hall, 1971Based on data from 319. - 378. K.; AC

References

Fuchs and Hallman, 1983
Fuchs, R.; Hallman, J.H., Heats of vaporization of some monosubstituted cyclopropane, cyclobutane, and cyclopentane derivatives. Some observations on the enthalpies of isodesmic ring opening reactions of cyclobutane derivatives, Can. J. Chem., 1983, 61, 503-505. [all data]

Hall and Baldt, 1971
Hall, H.K., Jr.; Baldt, J.H., Thermochemistry of strained-ring bridgehead nitriles and esters, J. Am. Chem. Soc., 1971, 93, 140-145. [all data]

Baldt and Hall, 1971
Baldt, J.H.; Hall, H.K.K., Jr., Thermochemistry of strained-ring bridgehead nitriles and esters, J. Am. Chem. Soc., 1971, 93, 140-145. [all data]