Ammonium hydrogen oxalate hemihydrate-d6

Condensed phase thermochemistry data

Data compiled by: Eugene S. Domalski and Elizabeth D. Hearing

Quantity Value Units Method Reference Comment
solid,1 bar48.865cal/mol*KN/AFukai, Matsuo, et al., 1989
solid,1 bar48.865cal/mol*KN/AFukai, Matsuo, et al., 1989

Constant pressure heat capacity of solid

Cp,solid (cal/mol*K) Temperature (K) Reference Comment
43.014298.15Fukai, Matsuo, et al., 1989T = 13 to 300 K.
43.014298.15Fukai, Matsuo, et al., 1989T = 13 to 300 K.

Phase change data

Data compiled by: Eugene S. Domalski and Elizabeth D. Hearing

Enthalpy of phase transition

ΔHtrs (kcal/mol) Temperature (K) Initial Phase Final Phase Reference Comment
0.00013160.1crystaline, IIcrystaline, IFukai, Matsuo, et al., 1989
0.00013160.1crystaline, IIcrystaline, IFukai, Matsuo, et al., 1989

Entropy of phase transition

ΔStrs (cal/mol*K) Temperature (K) Initial Phase Final Phase Reference Comment
0.985160.1crystaline, II, Ordercrystaline, I, disorder transitionFukai, Matsuo, et al., 1989
0.985160.1crystaline, II, Ordercrystaline, I, disorder transitionFukai, Matsuo, et al., 1989

References

Fukai, Matsuo, et al., 1989
Fukai, M.; Matsuo, T.; Suga, H., Calorimetric study of phase transitions in ammonium hydrogen oxalate hemihydrate and its deuterated compound, J. Phys. Chem. Solids, 1989, 50, 743-751. [all data]