Codeine

Kovats' RI, non-polar column, isothermal

Data compiled by: NIST Mass Spectrometry Data Center, William E. Wallace, director

Column type CapillaryCapillaryCapillaryCapillaryCapillary
Active phase Methyl SiliconeMethyl SiliconeMethyl SiliconeMethyl SiliconeMethyl Silicone
Column length (m)
Carrier gas
Substrate
Column diameter (mm)
Phase thickness (μm)
Temperature (C) 230.230.230.230.230.
I 2377.2380.2382.2387.2403.
ReferenceFranke, Wijsbeek, et al., 1990Franke, Wijsbeek, et al., 1990Franke, Wijsbeek, et al., 1990Franke, Wijsbeek, et al., 1990Franke, Wijsbeek, et al., 1990
Comment MSDC-RI MSDC-RI MSDC-RI MSDC-RI MSDC-RI
Column type PackedPacked
Active phase SE-30OV-1
Column length (m) 2.
Carrier gas N2
Substrate 1% se-30 on Anachrom ABS(80-100mesh)
Column diameter (mm)
Phase thickness (μm)
Temperature (C) 240.250.
I 2373.2410.
ReferenceMusumarra, Scarlata, et al., 1987Berninger and Möller, 1977
Comment MSDC-RI MSDC-RI

References

Franke, Wijsbeek, et al., 1990
Franke, J.-P.; Wijsbeek, J.; de Zeeuw, R.A., Interlaboratory reproducibility of retention indices in capillary gas chromatography, J. Forensic Sci., 1990, 35, 4, 813-820. [all data]

Musumarra, Scarlata, et al., 1987
Musumarra, G.; Scarlata, G.; Romano, G.; Cappello, G.; Clementi, S.; Giulietti, G., Qualitative organic analysis. Part 2. Identification of drugs by principal components analysis of standardized TLC data in four eluent systems and of retention indices on SE 30, J. Anal. Toxicol., 1987, 11, 4, 154-163, https://doi.org/10.1093/jat/11.4.154 . [all data]

Berninger and Möller, 1977
Berninger, H.; Möller, M.R., Retentionsindices zur gaschromatographischen Identifizierung von Arzneimitteln, Arch. Toxicol., 1977, 37, 4, 295-305, https://doi.org/10.1007/BF00330821 . [all data]