Dicyclopropa[cd,gh]pentalene,octahydro-

Gas phase thermochemistry data

Data compiled by: Hussein Y. Afeefy, Joel F. Liebman, and Stephen E. Stein

Quantity Value Units Method Reference Comment
Δfgas43.0kcal/molChydRoth, Adamczak, et al., 1991
Δfgas43.0 ± 1.0kcal/molCcbHassenruck, Martin, et al., 1987

Condensed phase thermochemistry data

Data compiled by: Hussein Y. Afeefy, Joel F. Liebman, and Stephen E. Stein

Quantity Value Units Method Reference Comment
Δfliquid33.04 ± 0.23kcal/molCcbHassenruck, Martin, et al., 1987

Phase change data

Data compiled by: Donald R. Burgess, Jr.

Quantity Value Units Method Reference Comment
Δvap9.99kcal/molN/AHassenruck, Martin, et al., 1987

Reaction thermochemistry data

Data compiled by: Hussein Y. Afeefy, Joel F. Liebman, and Stephen E. Stein

Individual Reactions

2Hydrogen + Dicyclopropa[cd,gh]pentalene,octahydro- = Bicyclo[3.2.1]octane

By formula: 2H2 + C8H10 = C8H14

Quantity Value Units Method Reference Comment
Δr-66.1kcal/molChydRoth, Adamczak, et al., 1991liquid phase

Gas phase ion energetics data

Data compiled as indicated in comments:
LLK - Sharon G. Lias, Rhoda D. Levin, and Sherif A. Kafafi

Ionization energy determinations

IE (eV) Method Reference Comment
8.4PEMartin, Heller, et al., 1974LLK
9.12 ± 0.02PEMartin, Heller, et al., 1974Vertical value; LLK

References

Roth, Adamczak, et al., 1991
Roth, W.R.; Adamczak, O.; Breuckmann, R.; Lennartz, H.-W.; Boese, R., Die Berechnung von Resonanzenergien; das MM2ERW-Kraftfeld, Chem. Ber., 1991, 124, 2499-2521. [all data]

Hassenruck, Martin, et al., 1987
Hassenruck, K.; Martin, H.-D.; Mayer, B.; Urbanek, T.; Zirwes, T.; Walsh, R.; Beckhaus, H.-D., An Experimental Approach to the C8H10 Hypersurface. Kinetic and Thermochemical Investigations on a Formally Forbidden Ground-state [2σ + 2π] Cycloaddition, Chem. Ber., 1987, 120, 177-186. [all data]

Martin, Heller, et al., 1974
Martin, H.-D.; Heller, C.; Werp, J., Bishomofulvenkonjugation. Photoelektronenspektren und elektronenstruktur homologer quadricyclane, Chem. Ber., 1974, 107, 1393. [all data]