1,2-Cyclopentanedione, 3-methyl-

Van Den Dool and Kratz RI, non-polar column, temperature ramp

Data compiled by: NIST Mass Spectrometry Data Center, William E. Wallace, director

Column type CapillaryCapillary
Active phase BPX-5BPX-5
Column length (m) 50.50.
Carrier gas HeHe
Substrate
Column diameter (mm) 0.3250.325
Phase thickness (μm) 0.50.5
Tstart (C) 20.20.
Tend (C) 250.250.
Heat rate (K/min) 4.4.
Initial hold (min) 2.2.
Final hold (min) 10.10.
I 1043.1043.
ReferenceHill, Isaacs, et al., 1999Hill, Isaacs, et al., 1999
Comment MSDC-RI MSDC-RI

References

Hill, Isaacs, et al., 1999
Hill, V.M.; Isaacs, N.S.; Ledward, D.A.; Ames, J.M., Effect of high hydrostatic pressure on the volatile components of a glucose-lysine model system, J. Agric. Food Chem., 1999, 47, 9, 3675-3681, https://doi.org/10.1021/jf990124z . [all data]