Bornyl isovalerate
- Formula: C15H26O2
- Molecular weight: 238.3657
- IUPAC Standard InChIKey: MPYYVGIJHREDBO-MQYJIDSJSA-N
- CAS Registry Number: 76-50-6
- Chemical structure:
- Other names: Butanoic acid, 3-methyl-, (1R,2S,4R)-1,7,7-trimethylbicyclo[2.2.1]hept-2-yl ester, rel-; Bornyval; Hysterol; Isovaleric acid, 2-bornyl ester, endo-; 2-Bornyl 3-methylbutyrate; Bornyl ester of isopentanoic acid; Borneol, isovalerate; 1,7,7-Trimethylbicyclo[2.2.1]hept-2-yl 3-methylbutanoate, endo-; Bornyl 3-methylbutanoate; Butanoic acid, 3-methyl-, 1,7,7-trimethylbicyclo[2.2.1]hept-2-yl ester, endo-; Isovaleric acid, 2-bornyl ester; NSC 68007; endo-bornyl isovalerate

Van Den Dool and Kratz RI, non-polar column, temperature ramp

Column type | Active phase | I | Reference | Comment |
---|---|---|---|---|
Capillary | SPB-1 | 1488. | Blagojevic, Radulovic, et al., 2006 | 30. m/0.25 mm/0.25 μm, He, 50. C @ 3. min, 5. K/min, 250. C @ 15. min |
Capillary | DB-5 | 1468. | Blagojevic, Radulovic, et al., 2006 | 30. m/0.2 mm/0.25 μm, He, 50. C @ 3. min, 5. K/min, 250. C @ 15. min |
Capillary | RTX-1 | 1501. | Paolini, Costa, et al., 2005 | 60. m/0.22 mm/0.25 μm, He, 2. K/min, 230. C @ 35. min; Tstart: 60. C |

Van Den Dool and Kratz RI, polar column, temperature ramp

Column type | Active phase | I | Reference | Comment |
---|---|---|---|---|
Capillary | RTX-Wax | 1753. | Paolini, Costa, et al., 2005 | 60. m/0.22 mm/0.25 μm, He, 2. K/min, 230. C @ 35. min; Tstart: 60. C |
Capillary | HP-Innowax | 1759. | Christensen, Jakobsen, et al., 1999 | He, 32. C @ 1. min, 2. K/min, 220. C @ 40. min; Column length: 60. m; Column diameter: 0.25 mm |

Normal alkane RI, non-polar column, temperature ramp

Column type | Active phase | I | Reference | Comment |
---|---|---|---|---|
Capillary | SPB-5 | 1500. | Raal, Orav, et al., 2007 | 30. m/0.25 mm/0.25 μm, He, 2. K/min; Tstart: 50. C; Tend: 250. C |
Capillary | RTX-1 | 1492. | Kalemba, 1999 | 30. m/0.25 mm/0.25 μm, N2, 4. K/min; Tstart: 60. C; Tend: 300. C |
Capillary | CP Sil 5 CB | 1492. | Bos, Woerdenbag, et al., 1997 | 25. m/0.32 mm/0.25 μm, N2, 4. K/min; Tstart: 50. C; Tend: 290. C |
Capillary | CP Sil 5 CB | 1492. | Bos, Woerdenbag, et al., 1997 | 25. m/0.32 mm/0.25 μm, N2, 4. K/min; Tstart: 50. C; Tend: 290. C |
Capillary | CP Sil 5 CB | 1492. | Bos, Woerdenbag, et al., 1997, 2 | 25. m/0.25 mm/0.25 μm, He, 6. K/min; Tstart: 60. C; Tend: 300. C |

Normal alkane RI, non-polar column, custom temperature program

Column type | Active phase | I | Reference | Comment |
---|---|---|---|---|
Capillary | DB-1 | 1516. | Delort and Jaquier, 2009 | 60. m/0.25 mm/0.25 μm, Helium; Program: 50 0C (5 min) 3 0C/min -> 120 0C 5 0C/min -> 250 0C (3 min) 15 0C/min -> 300 0C (20 min) |
Capillary | SE-30 | 1512. | Vinogradov, 2004 | Program: not specified |

Normal alkane RI, polar column, custom temperature program

Column type | Active phase | I | Reference | Comment |
---|---|---|---|---|
Capillary | Carbowax 20M | 1774. | Vinogradov, 2004 | Program: not specified |

References

Blagojevic, Radulovic, et al., 2006
Blagojevic, P.; Radulovic, N.; Palic, R.; Stojanovic, G.,
Chemical composition of the essential oils of Serbian wild-growing Srtemisia absinthium and Artemisia vulgaris,
J. Agric. Food Chem., 2006, 54, 13, 4780-4789, https://doi.org/10.1021/jf060123o
. [all data]
Paolini, Costa, et al., 2005
Paolini, J.; Costa, J.; Bernardini, A.,
Analysis of the essential oil from aerial parts of Eupatorium cannabinum subsp. corsicum (L.) by gas chromatography with electron impact and chemical ionization mass spectrometry,
J. Chromatogr. A, 2005, 1076, 1-2, 170-178, https://doi.org/10.1016/j.chroma.2005.03.131
. [all data]
Christensen, Jakobsen, et al., 1999
Christensen, L.P.; Jakobsen, H.B.; Paulsen, E.; Hodal, L.; Andersen, K.E.,
Airborne compositae dermatitis: monoterpenes and no parthenolide are released from flowering Tanacetum parthenium (feverfew) plants,
Arch. Dermatol. Res., 1999, 291, 7-8, 425-431, https://doi.org/10.1007/s004030050433
. [all data]
Raal, Orav, et al., 2007
Raal, A.; Orav, A.; Arak, E.; Kailas, T.; Müürisepp, M.,
Variation in the composition of the essential oil of Valeriana officinalis L. roots from Estonia,
Proc. Est. Acad. Sci. Chem., 2007, 56, 2, 67-74. [all data]
Kalemba, 1999
Kalemba, D.,
Constituents of the essential oil of Artemisia asiatica Nakai,
Flavour Fragr. J., 1999, 14, 3, 173-176, https://doi.org/10.1002/(SICI)1099-1026(199905/06)14:3<173::AID-FFJ805>3.0.CO;2-Q
. [all data]
Bos, Woerdenbag, et al., 1997
Bos, R.; Woerdenbag, H.J.; Hendriks, H.; Smit, H.F.; Wikström, H.V.; Scheffer, J.J.C.,
Composition of the essential oil from roots and rhizomes of Valeriana wallichii DC,
Flavour Fragr. J., 1997, 12, 2, 123-131, https://doi.org/10.1002/(SICI)1099-1026(199703)12:2<123::AID-FFJ613>3.0.CO;2-4
. [all data]
Bos, Woerdenbag, et al., 1997, 2
Bos, R.; Woerdenbag, H.J.; Hendriks, H.; Scheffer, J.J.C.,
Composition of the essential oils from underground parts of Valeriana officinalis L. s.l. and several closely related taxa,
Flavour Fragr. J., 1997, 12, 5, 359-370, https://doi.org/10.1002/(SICI)1099-1026(199709/10)12:5<359::AID-FFJ660>3.0.CO;2-G
. [all data]
Delort and Jaquier, 2009
Delort, E.; Jaquier, A.,
Novel terpenyl esters from Australian finger lime (Citrus australasica) peel extract,
Flav. Fragr. J., 2009, 24, 3, 123-132, https://doi.org/10.1002/ffj.1922
. [all data]
Vinogradov, 2004
Vinogradov, B.A.,
Production, composition, properties and application of essential oils, 2004, retrieved from http://viness.narod.ru. [all data]