Bornyl acetate

Van Den Dool and Kratz RI, non-polar column, temperature ramp

Data compiled by: NIST Mass Spectrometry Data Center, William E. Wallace, director

Column type CapillaryCapillaryCapillaryCapillaryCapillary
Active phase Equity-5MSHP-5MSHP-5BP-1HP-5MS
Column length (m) 30.30.25.50.30.
Carrier gas HeHeHeHeHe
Substrate
Column diameter (mm) 0.250.250.250.220.25
Phase thickness (μm) 0.250.250.250.250.25
Tstart (C) 50.60.60.60.60.
Tend (C) 250.250.240.220.280.
Heat rate (K/min) 3.2.4.2.3.
Initial hold (min)  8.2.
Final hold (min) 10.30. 20.
I 1284.1287.1291.1269.1289.
ReferenceBelsito E.L., Carbone C., et al., 2007Benkaci-Ali, Baaliouamer, et al., 2007Dehghan, Solaimanian, et al., 2007Duquesnoy, Castola, et al., 2007Kundakovic, Fokialakis, et al., 2007
Comment MSDC-RI MSDC-RI MSDC-RI MSDC-RI MSDC-RI
Column type CapillaryCapillaryCapillaryCapillaryCapillary
Active phase BP-1RTX-1RTX-1RTX-1HP-101
Column length (m) 50.60.60.60.25.
Carrier gas HeHeHeHeHe
Substrate
Column diameter (mm) 0.220.220.220.220.2
Phase thickness (μm) 0.250.250.250.250.2
Tstart (C) 60.60.60.60.70.
Tend (C) 220.230.230.230.200.
Heat rate (K/min) 2.2.2.2.3.
Initial hold (min)     2.
Final hold (min) 20.30.35.35.15.
I 1270.1264.1269.1269.1252.
ReferenceLesueur, de Rocca Serra, et al., 2007Muselli, Rossi, et al., 2007Paolini J., Costa J., et al., 2007Paolini, Muselli, et al., 2007Politeo, Jukic, et al., 2007
Comment MSDC-RI MSDC-RI MSDC-RI MSDC-RI MSDC-RI
Column type CapillaryCapillaryCapillaryCapillaryCapillary
Active phase SPB-1HP-5MSZB-5HP-5MSDB-5
Column length (m) 30.30.30.30.30.
Carrier gas HeHeHeHeHe
Substrate
Column diameter (mm) 0.250.250.250.250.25
Phase thickness (μm) 0.250.250.250.250.25
Tstart (C) 50.60.50.60.50.
Tend (C) 250.280.250.280.250.
Heat rate (K/min) 5.4.3.3.3.
Initial hold (min) 3.5.
Final hold (min) 15.   10.
I 1259.1285.1285.1284.1286.
ReferenceRadulovic, Lazarevic, et al., 2007Radulovic, Lazarevic, et al., 2007Simoniatto, Bonani, et al., 2007Vagionas, Ngassapa, et al., 2007Yu, Liao, et al., 2007
Comment MSDC-RI MSDC-RI MSDC-RI MSDC-RI MSDC-RI
Column type CapillaryCapillaryCapillaryCapillaryCapillary
Active phase CP Sil 5 CBSPB-1DB-5BP-1RTX-1
Column length (m) 30.30.30.50.60.
Carrier gas N2HeHeHeHe
Substrate
Column diameter (mm) 0.250.250.20.220.22
Phase thickness (μm) 0.250.250.250.250.25
Tstart (C) 50.50.50.60.60.
Tend (C) 200.250.250.220.230.
Heat rate (K/min) 5.5.5.2.2.
Initial hold (min)  3.3.
Final hold (min)  15.15.20.45.
I 1279.1258.1280.1262.1271.
ReferenceAndrianoelisoa H.S., Menut C., et al., 2006Blagojevic, Radulovic, et al., 2006Blagojevic, Radulovic, et al., 2006Boti, Bighelli, et al., 2006Cavalli, Tomi, et al., 2006
Comment MSDC-RI MSDC-RI MSDC-RI MSDC-RI MSDC-RI
Column type CapillaryCapillaryCapillaryCapillaryCapillary
Active phase 5 % Phenyl methyl siloxaneDB-5DB-5BP-1DB-5
Column length (m) 25.30.30.50.50.
Carrier gas HeN2N2HeN2
Substrate
Column diameter (mm) 0.250.320.250.220.2
Phase thickness (μm) 0.250.250.250.250.32
Tstart (C) 60.60.60.60.60.
Tend (C) 280.240.240.220.220.
Heat rate (K/min) 3.3.3.2.5.
Initial hold (min)  3.3. 3.
Final hold (min) 20.5.3.20.5.
I 1282.1273.1280.1268.1285.
ReferenceDjarri, Medjroubi, et al., 2006Dob, Dahmane, et al., 2006Dob, Dahmane, et al., 2006, 2Duquesnoy, Dinh, et al., 2006Esmaeili, Nematollahi, et al., 2006
Comment MSDC-RI MSDC-RI MSDC-RI MSDC-RI MSDC-RI
Column type CapillaryCapillaryCapillaryCapillaryCapillary
Active phase BP-1HP-5HP-5HP-5MSDB-1
Column length (m) 50.30.30.20.30.
Carrier gas HeHeHe N2
Substrate
Column diameter (mm) 0.220.250.250.250.25
Phase thickness (μm) 0.250.250.250.250.25
Tstart (C) 60.60.60.60.50.
Tend (C) 220.260.250.240.220.
Heat rate (K/min) 2.3.3.5.4.
Initial hold (min)    4.
Final hold (min) 20.  15.
I 1271.1288.1287.1288.1282.
ReferenceGonny, Cavaleiro, et al., 2006Javidnia, Miri, et al., 2006Javidnia, Miri, et al., 2006, 2Kallio, Jussila, et al., 2006Kuiate, Bessière, et al., 2006
Comment MSDC-RI MSDC-RI MSDC-RI MSDC-RI MSDC-RI
Column type CapillaryCapillaryCapillaryCapillaryCapillary
Active phase DB-5SPB-1SPB-1SPB-1HP-5MS
Column length (m) 50.30.30.30.30.
Carrier gas N2HeHeHeHe
Substrate
Column diameter (mm) 0.20.20.250.20.25
Phase thickness (μm) 0.320.20.250.20.25
Tstart (C) 60.70.50.70.60.
Tend (C) 220.220.250.220.280.
Heat rate (K/min) 5.3.5.3.4.
Initial hold (min) 3. 3. 5.
Final hold (min) 5.15.15.15.
I 1285.1264.1260.1266.1292.
ReferenceMasoudi, Esmaeili, et al., 2006Pinto, Pina-Vaz, et al., 2006Radulovic, Mananjarasoa, et al., 2006Salgueiro L.R., Pinto E., et al., 2006Saroglou, Dorizas, et al., 2006
Comment MSDC-RI MSDC-RI MSDC-RI MSDC-RI MSDC-RI
Column type CapillaryCapillaryCapillaryCapillaryCapillary
Active phase DB-5SPB-1DB-5BP-1SE-54
Column length (m) 30.30.30.50.50.
Carrier gas HeHeHeHeH2
Substrate
Column diameter (mm) 0.250.250.20.220.25
Phase thickness (μm) 0.250.250.250.250.27
Tstart (C) 50.50.50.60.50.
Tend (C) 250.250.250.220.300.
Heat rate (K/min) 5.5.5.2.5.
Initial hold (min) 2.3.3.
Final hold (min)  15.15.20.
I 1289.1259.1270.1270.1284.
ReferenceSu, Ho, et al., 2006Boskovic, Radulovic, et al., 2005Boskovic, Radulovic, et al., 2005Boti J.B., Koukoua G., et al., 2005Brantner, Pfeifhofer, et al., 2005
Comment MSDC-RI MSDC-RI MSDC-RI MSDC-RI MSDC-RI
Column type CapillaryCapillaryCapillaryCapillaryCapillary
Active phase RTX-1DB-1DB-1BP-1CP Sil 5 CB
Column length (m) 60.30.30.50.50.
Carrier gas  N2 HeH2
Substrate
Column diameter (mm) 0.220.320.320.220.22
Phase thickness (μm) 0.250.250.250.250.13
Tstart (C) 60.50.50.60.40.
Tend (C) 220.260.250.220.300.
Heat rate (K/min) 2.2.2.2.4.
Initial hold (min)  3.8.
Final hold (min) 20.5. 20.10.
I 1270.1252.1259.1268.1267.
ReferenceCozzani, Muselli, et al., 2005Dob, Berramdane, et al., 2005Dob, Dahmane, et al., 2005Ferrari, Tomi, et al., 2005Idzojtic, Kajba, et al., 2005
Comment MSDC-RI MSDC-RI MSDC-RI MSDC-RI MSDC-RI
Column type CapillaryCapillaryCapillaryCapillaryCapillary
Active phase HP-5RTX-1HP-5MSDB-5DB-5
Column length (m) 30.60.30.30.30.
Carrier gas HeHeHeHeHe
Substrate
Column diameter (mm) 0.250.220.250.250.25
Phase thickness (μm) 0.250.250.250.260.25
Tstart (C) 50.60.60.60.40.
Tend (C) 250.230.250.210.260.
Heat rate (K/min) 4.2.4.3.2.
Initial hold (min) 5. 2. 5.
Final hold (min) 15.35.20. 20.
I 1282.1269.1285.1291.1284.
ReferenceMahattanatawee, Goodner, et al., 2005Paolini, Costa, et al., 2005Pino, Mesa, et al., 2005Sati and Mathela, 2005Senatore, Napolitano, et al., 2005
Comment MSDC-RI MSDC-RI MSDC-RI MSDC-RI MSDC-RI
Column type CapillaryCapillaryCapillaryCapillaryCapillary
Active phase DB-5MSSE-54SPB-1ZB-5BP-1
Column length (m) 60.30.30.0.50.
Carrier gas HeHeHe
Substrate
Column diameter (mm) 0.250.250.250.320.22
Phase thickness (μm) 0.250.250.250.50.25
Tstart (C) 40.60.70.40.60.
Tend (C) 200.260.220.265.220.
Heat rate (K/min) 2.2.3.7.2.
Initial hold (min)  5.
Final hold (min) 20. 15.5.20.
I 1283.1282.1266.1287.1270.
ReferenceSeo and Baek, 2005Alma, Nitz, et al., 2004Antunes, Sevinate-Pinto, et al., 2004Gocmen, Gurbuz, et al., 2004Gonny, Bradesi, et al., 2004
Comment MSDC-RI MSDC-RI MSDC-RI MSDC-RI MSDC-RI
Column type CapillaryCapillaryCapillaryCapillaryCapillary
Active phase HP-5DB-5DB-5MSSPB-1HP-5MS
Column length (m) 30.30.30.30.30.
Carrier gas HeHeHeHeHe
Substrate
Column diameter (mm) 0.250.250.250.20.25
Phase thickness (μm) 0.250.250.250.20.25
Tstart (C) 40.60.40.70.50.
Tend (C) 250.260.280.220.300.
Heat rate (K/min) 3.3.4.3.5.
Initial hold (min)   2. 5.
Final hold (min)    15.
I 1289.1284.1287.1267.1287.
ReferenceIsidorov, Krajewska, et al., 2004Javidnia, Miri, et al., 2004Mardarowicz, Wianowska, et al., 2004Moldão-Martins, Beirão-da-Costa, et al., 2004Mumm, Tiemann, et al., 2004
Comment MSDC-RI MSDC-RI MSDC-RI MSDC-RI MSDC-RI
Column type CapillaryCapillaryCapillaryCapillaryCapillary
Active phase DB-5HP-5MSHP-5MSOptima 5DB-5MS
Column length (m) 30.30.30.25.30.
Carrier gas HeHeHeHeHe
Substrate
Column diameter (mm) 0.250.250.250.250.25
Phase thickness (μm) 0.250.250.250.250.25
Tstart (C) 60.50.60.60.40.
Tend (C) 275.250.280.280.200.
Heat rate (K/min) 4.3.3.3.4.
Initial hold (min)     5.
Final hold (min)    20.20.
I 1279.1286.1266.1281.1288.
ReferenceRamezani, Khaje-Karamoddin, et al., 2004Salido, Valenzuela, et al., 2004Tzakou, Vagias, et al., 2004Vérité, Nacer, et al., 2004Yu, Kim, et al., 2004
Comment MSDC-RI MSDC-RI MSDC-RI MSDC-RI MSDC-RI
Column type CapillaryCapillaryCapillaryCapillaryCapillary
Active phase DB-5MSDB-5MSDB-5MSDB-5MSHP-5
Column length (m) 30.30.30.30.30.
Carrier gas HeHeHeHeN2
Substrate
Column diameter (mm) 0.250.250.250.250.25
Phase thickness (μm) 0.250.250.250.250.25
Tstart (C) 40.40.40.40.60.
Tend (C) 200.200.200.200.220.
Heat rate (K/min) 4.4.4.4.5.
Initial hold (min) 5.5.5.5.10.
Final hold (min) 20.20.20.20.
I 1289.1291.1292.1286.1286.
ReferenceYu, Kim, et al., 2004Yu, Kim, et al., 2004, 2Yu, Kim, et al., 2004, 2Zheng, Kim, et al., 2004Angelini, Carpanese, et al., 2003
Comment MSDC-RI MSDC-RI MSDC-RI MSDC-RI MSDC-RI
Column type CapillaryCapillaryCapillaryCapillaryCapillary
Active phase SPB-1RTX-1DB-5HP-5HP-5MS
Column length (m) 30.60.25.30.30.
Carrier gas HeHeHeHeHe
Substrate
Column diameter (mm) 0.20.220.250.250.25
Phase thickness (μm) 0.20.25 0.250.25
Tstart (C) 70.60.60.60.50.
Tend (C) 220.230.260.280.250.
Heat rate (K/min) 3.2.4.3.3.
Initial hold (min)
Final hold (min) 15.45.
I 1267.1271.1288.1285.1286.
ReferenceCavaleiro, Salgueiro, et al., 2003Cavalli, Tomi, et al., 2003Javidnia, Miri, et al., 2003Ngassapa, Runyoro, et al., 2003Salido, Altarejos, et al., 2003
Comment MSDC-RI MSDC-RI MSDC-RI MSDC-RI MSDC-RI
Column type CapillaryCapillaryCapillaryCapillaryCapillary
Active phase MS5HP-5Mega 5MSSPB-1DB-5
Column length (m) 25.30.30.30.30.
Carrier gas  HeHeHeHe
Substrate
Column diameter (mm) 0.250.250.250.200.25
Phase thickness (μm) 0.250.250.250.200.25
Tstart (C) 40.60.40.70.70.
Tend (C) 180.280.240.220.230.
Heat rate (K/min) 3.3.3.3.4.
Initial hold (min)   2. 2.
Final hold (min)    15.20.
I 1284.1288.1275.1264.1279.
ReferenceShao, Marriott, et al., 2003Tzakou, Couladis, et al., 2003Verzera, Trozzi, et al., 2003Cavaleiro, Salgueiro, et al., 2002Choi, Kim. M.-S.L., et al., 2002
Comment MSDC-RI MSDC-RI MSDC-RI MSDC-RI MSDC-RI
Column type CapillaryCapillaryCapillaryCapillaryCapillary
Active phase DB-5HP-5BP-1CP Sil 5 CBDB-1
Column length (m) 30.30.50.25.50.
Carrier gas He HeN2He
Substrate
Column diameter (mm) 0.250.250.220.250.22
Phase thickness (μm) 0.250.250.250.250.25
Tstart (C) 60.60.60.60.60.
Tend (C) 240.280.220.280.220.
Heat rate (K/min) 3.3.2.4.2.
Initial hold (min)  5. 6.
Final hold (min)   20. 20.
I 1287.1285.1270.1270.1272.
ReferenceFlamini, Cioni, et al., 2002Fokialakis, Magiatis, et al., 2002Lota, de Rocca Serra, et al., 2002Pino, Marbot, et al., 2002Pintore, Usai, et al., 2002
Comment MSDC-RI MSDC-RI MSDC-RI MSDC-RI MSDC-RI
Column type CapillaryCapillaryCapillaryCapillaryCapillary
Active phase RTX-5RTX-5HP-5HP-5HP-5
Column length (m) 30.30.30.30.30.
Carrier gas HeHeHeHeHe
Substrate
Column diameter (mm) 0.250.250.250.250.25
Phase thickness (μm) 0.250.250.250.250.25
Tstart (C) 45.45.60.60.60.
Tend (C) 250.250.280.280.380.
Heat rate (K/min) 3.3.3.3.3.
Initial hold (min) 6.6.5.5.
Final hold (min)
I 1285.1293.1286.1281.1281.
ReferenceShellie, Mondello, et al., 2002Shellie, Mondello, et al., 2002Aligiannis, Kalpoutzakis, et al., 2001Aligiannis, Kalpoutzakis, et al., 2001, 2Couladis, Tsortanidou, et al., 2001
Comment MSDC-RI MSDC-RI MSDC-RI MSDC-RI MSDC-RI
Column type CapillaryCapillaryCapillaryCapillaryCapillary
Active phase HP-5HP-5MSCP Sil 5 CBBP-1HP-5MS
Column length (m) 30.30.50.50.30.
Carrier gas HeHeHeHeHe
Substrate
Column diameter (mm) 0.250.250.320.220.25
Phase thickness (μm) 0.500.250.40.250.25
Tstart (C) 60.60.60.60.50.
Tend (C) 280.280.280.220.250.
Heat rate (K/min) 3.3.3.2.3.
Initial hold (min)  5.10.
Final hold (min)   60.20.
I 1288.1285.1274.1270.1286.
ReferenceCouladis, Tzakou, et al., 2001Giamakis, Kretsi, et al., 2001Pino, Marbot, et al., 2001Rezzi, Bighelli, et al., 2001Salido, Altarejos, et al., 2001
Comment MSDC-RI MSDC-RI MSDC-RI MSDC-RI MSDC-RI
Column type CapillaryCapillaryCapillaryCapillaryCapillary
Active phase HP-5MSDB-5HP-5HP-101CP Sil 5 CB
Column length (m) 30.60.30.25.50.
Carrier gas HeHeHeHeH2
Substrate
Column diameter (mm) 0.250.250.250.20.22
Phase thickness (μm) 0.250.250.250.20.13
Tstart (C) 60.40.40.70.40.
Tend (C) 280.290.200.200.300.
Heat rate (K/min) 4.4.2.3.4.
Initial hold (min) 5.2.5.2.
Final hold (min)  5.20.10.10.
I 1284.1268.1290.1266.1274.
ReferenceSkaltsa, Mavrommati, et al., 2001Bartley and Jacobs, 2000Kim, Thuy, et al., 2000Milos and Radonic, 2000Pfeifhofer, 2000
Comment MSDC-RI MSDC-RI MSDC-RI MSDC-RI MSDC-RI
Column type CapillaryCapillaryCapillaryCapillaryCapillary
Active phase Mega 5MSBP-1DB-1HP-1Methyl Silicone
Column length (m) 30.50.60.60.50.
Carrier gas HeHeHeHeN2
Substrate
Column diameter (mm) 0.250.220.250.250.25
Phase thickness (μm) 0.250.250.250.250.17
Tstart (C) 40.60.50.50.80.
Tend (C) 240.220.220.250.200.
Heat rate (K/min) 3.2.4.2.52.
Initial hold (min) 2.  5.
Final hold (min)  20.
I 1275.1268.1275.1272.1278.
ReferenceVerzera, la Rosa, et al., 2000Mazzoni, Tomi, et al., 1999Mirza and Sefidkon, 1999Stashenko, Cervantes, et al., 1999Sumathykutty, Rao, et al., 1999
Comment MSDC-RI MSDC-RI MSDC-RI MSDC-RI MSDC-RI
Column type CapillaryCapillaryCapillaryCapillaryCapillary
Active phase OV-1CP Sil 5 CBOV-1DB-5HP-5
Column length (m) 20.25.25.30.
Carrier gas HeHe  He
Substrate
Column diameter (mm) 0.320.250.250.250.26
Phase thickness (μm) 0.3 0.30.250.25
Tstart (C) 45.60.50.50.60.
Tend (C) 220.260.200.250.240.
Heat rate (K/min) 10.5.3.3.3.
Initial hold (min) 5. 1.
Final hold (min) 10. 20.
I 1270.1273.1263.1288.1284.
ReferenceValero, Sanz, et al., 1999Weyerstahl, Marschall, et al., 1999Bicchi, Rubiolo, et al., 1998Isidorov, Zenkevich, et al., 1998Oprean, Tamas, et al., 1998
Comment MSDC-RI MSDC-RI MSDC-RI MSDC-RI MSDC-RI
Column type CapillaryCapillaryCapillaryCapillaryCapillary
Active phase Methyl SiliconeBP-1DB-5CP Sil 5 CBDB-5
Column length (m)  50.30.25.30.
Carrier gas  HeHeHeHe
Substrate
Column diameter (mm)  0.220.320.220.25
Phase thickness (μm)  0.25 0.11
Tstart (C) 50.60.80.80.50.
Tend (C) 250.230.200.230.250.
Heat rate (K/min) 4.2.2.1.4.
Initial hold (min)    8.
Final hold (min)  35.30.16.
I 1271.1267.1284.1283.1287.
ReferenceAnalytical Methods Committee, 1997Mariotti, Tomi, et al., 1997Vahirua-Lechat, Menut, et al., 1996Chanegriha and Baaliouamer, 1993Gómez, Ledbetter, et al., 1993
Comment MSDC-RI MSDC-RI MSDC-RI MSDC-RI MSDC-RI
Column type CapillaryCapillaryCapillaryCapillaryCapillary
Active phase OV-101OV-101DB-5OV-1OV-1
Column length (m) 50.50.60.30.30.
Carrier gas N2N2HeHeHe
Substrate
Column diameter (mm) 0.250.250.320.50.5
Phase thickness (μm)   1.0.80.8
Tstart (C) 80.80.40.40.40.
Tend (C) 200.200.220.220.220.
Heat rate (K/min) 2.2.3.2.2.
Initial hold (min)
Final hold (min)
I 1274.1275.1290.1264.1269.
ReferenceYang, Sugisawa, et al., 1992Yang, Sugisawa, et al., 1992Le Quere and Latrasse, 1990De Pooter, Omar, et al., 1985De Pooter, Omar, et al., 1985
Comment MSDC-RI MSDC-RI MSDC-RI MSDC-RI MSDC-RI

Van Den Dool and Kratz RI, polar column, temperature ramp

Data compiled by: NIST Mass Spectrometry Data Center, William E. Wallace, director

Column type CapillaryCapillaryCapillaryCapillaryCapillary
Active phase BP-20HP-InnowaxBP-20HP-20MHP-20M
Column length (m) 50.30.50.50.50.
Carrier gas HeHeHeHeHe
Substrate
Column diameter (mm) 0.220.250.220.20.2
Phase thickness (μm) 0.250.250.250.20.2
Tstart (C) 60.60.60.70.70.
Tend (C) 220.280.220.180.180.
Heat rate (K/min) 2.3.2.4.4.
Initial hold (min)    4.4.
Final hold (min) 20. 20.10.15.
I 1580.1591.1574.1549.1546.
ReferenceDuquesnoy, Castola, et al., 2007Kundakovic, Fokialakis, et al., 2007Lesueur, de Rocca Serra, et al., 2007Maksimovic, Vidic, et al., 2007Maric, Jukic, et al., 2007
Comment MSDC-RI MSDC-RI MSDC-RI MSDC-RI MSDC-RI
Column type CapillaryCapillaryCapillaryCapillaryCapillary
Active phase RTX-WaxRTX-WaxRTX-WaxHP-20MHP-20M
Column length (m) 60.60.60.50.50.
Carrier gas HeHeHeHeliumHe
Substrate
Column diameter (mm) 0.220.220.220.200.2
Phase thickness (μm) 0.250.250.250.200.2
Tstart (C) 60.60.60.70.70.
Tend (C) 230.230.230.180.180.
Heat rate (K/min) 2.2.2.4.4.
Initial hold (min)    4.4.
Final hold (min) 30.35.35.15.15.
I 1553.1579.1579.1534.1545.
ReferenceMuselli, Rossi, et al., 2007Paolini J., Costa J., et al., 2007Paolini, Muselli, et al., 2007Politeo, Jukic, et al., 2007Politeo, Jukic, et al., 2007, 2
Comment MSDC-RI MSDC-RI MSDC-RI MSDC-RI MSDC-RI
Column type CapillaryCapillaryCapillaryCapillaryCapillary
Active phase BP-20RTX-WaxBP-20BP-20DB-Wax
Column length (m) 50.60.50.50.60.
Carrier gas HeHeHeHeHe
Substrate
Column diameter (mm) 0.220.220.220.220.32
Phase thickness (μm) 0.250.250.250.250.25
Tstart (C) 60.60.60.60.35.
Tend (C) 220.230.220.220.220.
Heat rate (K/min) 2.2.2.2.3.
Initial hold (min)
Final hold (min) 20.45.20.20.
I 1570.1575.1573.1577.1579.
ReferenceBoti, Bighelli, et al., 2006Cavalli, Tomi, et al., 2006Duquesnoy, Dinh, et al., 2006Gonny, Cavaleiro, et al., 2006Pala-Paul, Copeland, et al., 2006
Comment MSDC-RI MSDC-RI MSDC-RI MSDC-RI MSDC-RI
Column type CapillaryCapillaryCapillaryCapillaryCapillary
Active phase Supelcowax-10Supelcowax-10DB-WaxBP-20RTX-Wax
Column length (m) 30.30.30.50.60.
Carrier gas HeHeHeHe
Substrate
Column diameter (mm) 0.20.20.250.220.22
Phase thickness (μm) 0.20.20.250.250.25
Tstart (C) 70.70.40.60.60.
Tend (C) 220.220.240.220.220.
Heat rate (K/min) 3.3.6.2.2.
Initial hold (min)   10.
Final hold (min) 15.15.25.20.20.
I 1574.1578.1554.1582.1555.
ReferencePinto, Pina-Vaz, et al., 2006Salgueiro L.R., Pinto E., et al., 2006Varming, Andersen, et al., 2006Boti J.B., Koukoua G., et al., 2005Cozzani, Muselli, et al., 2005
Comment MSDC-RI MSDC-RI MSDC-RI MSDC-RI MSDC-RI
Column type CapillaryCapillaryCapillaryCapillaryCapillary
Active phase BP-20InnowaxRTX-WaxDB-WaxDB-Wax
Column length (m) 50.50.60.30.0.
Carrier gas HeHeHeHe
Substrate
Column diameter (mm) 0.220.250.220.250.32
Phase thickness (μm) 0.250.250.250.250.5
Tstart (C) 60.50.60.40.40.
Tend (C) 220.220.230.200.240.
Heat rate (K/min) 2.2.2.2.7.
Initial hold (min)  3.
Final hold (min) 20.20.35.20.5.
I 1575.1575.1579.1559.1595.
ReferenceFerrari, Tomi, et al., 2005Lee, Lee, et al., 2005Paolini, Costa, et al., 2005Seo and Baek, 2005Gocmen, Gurbuz, et al., 2004
Comment MSDC-RI MSDC-RI MSDC-RI MSDC-RI MSDC-RI
Column type CapillaryCapillaryCapillaryCapillaryCapillary
Active phase BP-20DB-WaxDB-WaxDB-WaxDB-Wax
Column length (m) 50.30.30.30.30.
Carrier gas  HeHeHeHe
Substrate
Column diameter (mm) 0.220.250.250.250.25
Phase thickness (μm) 0.250.250.250.250.25
Tstart (C) 60.40.40.40.40.
Tend (C) 220.200.200.200.200.
Heat rate (K/min) 2.4.4.4.4.
Initial hold (min)  5.5.5.5.
Final hold (min) 20.20.20.20.20.
I 1579.1559.1566.1570.1563.
ReferenceGonny, Bradesi, et al., 2004Yu, Kim, et al., 2004Yu, Kim, et al., 2004Yu, Kim, et al., 2004, 2Yu, Kim, et al., 2004, 2
Comment MSDC-RI MSDC-RI MSDC-RI MSDC-RI MSDC-RI
Column type CapillaryCapillaryCapillaryCapillaryCapillary
Active phase DB-WaxHP-20MRTX-WaxHP-20MHP-Innowax
Column length (m) 30.50.60.50.30.
Carrier gas HeHeHeHeHe
Substrate
Column diameter (mm) 0.250.20.220.20.25
Phase thickness (μm) 0.250.20.250.20.5
Tstart (C) 40.70.60.70.60.
Tend (C) 200.180.230.180.260.
Heat rate (K/min) 4.4.2.4.3.
Initial hold (min) 5.4. 4.
Final hold (min) 20.10.45.10.
I 1572.1561.1573.1561.1590.
ReferenceZheng, Kim, et al., 2004Bezic, Skocibusic, et al., 2003Cavalli, Tomi, et al., 2003Jerkovic, Mastelic, et al., 2003Tzakou, Couladis, et al., 2003
Comment MSDC-RI MSDC-RI MSDC-RI MSDC-RI MSDC-RI
Column type CapillaryCapillaryCapillaryCapillaryCapillary
Active phase DB-WaxBP-20RTX-WaxBP-20HP-Innowax
Column length (m) 60.50.30.50.30.
Carrier gas N2HeHe He
Substrate
Column diameter (mm) 0.250.220.250.220.25
Phase thickness (μm) 0.250.250.250.250.50
Tstart (C) 70.60.45.60.60.
Tend (C) 230.220.250.220.260.
Heat rate (K/min) 2.2.3.2.3.
Initial hold (min)   6.
Final hold (min) 20.20.10.20.
I 1590.1573.1563.1573.1590.
ReferenceChoi, Kim. M.-S.L., et al., 2002Lota, de Rocca Serra, et al., 2002Mondello, Zappia, et al., 2002Pintore, Usai, et al., 2002Couladis, Tzakou, et al., 2001
Comment MSDC-RI MSDC-RI MSDC-RI MSDC-RI MSDC-RI
Column type CapillaryCapillaryCapillaryCapillaryCapillary
Active phase CP-Wax 52CBAT-WaxBP-20DB-WaxDB-Wax
Column length (m) 50.60.50.60.60.
Carrier gas  HeHeHeHe
Substrate
Column diameter (mm) 0.250.320.220.50.53
Phase thickness (μm) 0.20.250.250.321.0
Tstart (C) 32.65.60.40.50.
Tend (C) 220.250.220.290.220.
Heat rate (K/min) 1.2.2.4.3.
Initial hold (min) 1.10. 2.
Final hold (min)  60.20.5.
I 1574.1562.1571.1590.1580.
ReferenceKjeldsen, Christensen, et al., 2001Pino, Marbot, et al., 2001Rezzi, Bighelli, et al., 2001Bartley and Jacobs, 2000Brophy, Goldsack, et al., 2000
Comment MSDC-RI MSDC-RI MSDC-RI MSDC-RI MSDC-RI
Column type CapillaryCapillaryCapillaryCapillaryCapillary
Active phase DB-WaxDB-WaxHP-20MHP-InnowaxBP-20
Column length (m) 60.30.50.60.50.
Carrier gas N2He HeHe
Substrate
Column diameter (mm) 0.250.250.20.250.22
Phase thickness (μm) 0.250.250.2 0.25
Tstart (C) 70.40.70.32.60.
Tend (C) 230.200.180.220.220.
Heat rate (K/min) 2.2.4.2.2.
Initial hold (min) 2.5.4.1.
Final hold (min) 20.20.10.40.20.
I 1592.1567.1550.1584.1575.
ReferenceChoi and Sawamura, 2000Kim, Thuy, et al., 2000Milos and Radonic, 2000Christensen, Jakobsen, et al., 1999Mazzoni, Tomi, et al., 1999
Comment MSDC-RI MSDC-RI MSDC-RI MSDC-RI MSDC-RI
Column type CapillaryCapillaryCapillaryCapillaryCapillary
Active phase InnowaxCarbowax 20MBP-20Supelcowax-10Carbowax 20M
Column length (m) 60.25.50.60.60.
Carrier gas HeH2HeHeHe
Substrate
Column diameter (mm) 0.250.250.220.250.32
Phase thickness (μm) 0.250.30.250.250.425
Tstart (C) 50.50.60.60.45.
Tend (C) 180.200.230.230.300.
Heat rate (K/min) 2.53.2.5.3.
Initial hold (min) 5.1. 5.3.
Final hold (min)  20.35.20.20.
I 1594.1582.1568.1592.1580.
ReferenceStashenko, Cervantes, et al., 1999Bicchi, Rubiolo, et al., 1998Mariotti, Tomi, et al., 1997Granicher, Christen, et al., 1995Mondello, Dugo, et al., 1995
Comment MSDC-RI MSDC-RI MSDC-RI MSDC-RI MSDC-RI
Column type CapillaryCapillaryCapillary
Active phase DB-WaxCarbowax 20MCarbowax 20M
Column length (m) 30.60.60.
Carrier gas HeHeHe
Substrate
Column diameter (mm) 0.320.320.32
Phase thickness (μm) 0.5
Tstart (C) 40.50.50.
Tend (C) 220.225.225.
Heat rate (K/min) 3.1.51.5
Initial hold (min)
Final hold (min)  80.80.
I 1577.1559.1587.
ReferenceLe Quere and Latrasse, 1990Chen and Ho, 1988Chen and Ho, 1988
Comment MSDC-RI MSDC-RI MSDC-RI

Kovats' RI, polar column, temperature ramp

Data compiled by: NIST Mass Spectrometry Data Center, William E. Wallace, director

Column type CapillaryCapillaryCapillaryCapillaryCapillary
Active phase DB-WaxDB-WaxDB-WaxCarbowax 20MCarbowax 20M
Column length (m) 30.30.30.50.50.
Carrier gas H2HeHe
Substrate
Column diameter (mm) 0.250.320.250.320.32
Phase thickness (μm) 0.250.250.250.20.2
Tstart (C) 40.40.60.60.60.
Tend (C) 260.220.220.260.260.
Heat rate (K/min) 4.3.2.2.2.
Initial hold (min) 2.5.5.
Final hold (min) 15. 5.
I 1600.1567.1545.1578.1584.
ReferenceAvato, Raffo, et al., 2004Lopes, Strobl, et al., 2004Nagarajan, Rao, et al., 2001Vera and Chane-Ming, 1999Vera and Chane-Ming, 1999
Comment MSDC-RI MSDC-RI MSDC-RI MSDC-RI MSDC-RI
Column type CapillaryCapillaryCapillaryCapillary
Active phase Supelcowax-10BP-20Carbowax 20MCarbowax 20M
Column length (m) 60.25.50.50.
Carrier gas He
Substrate
Column diameter (mm) 0.250.3320.280.28
Phase thickness (μm)
Tstart (C) 35.70.80.80.
Tend (C) 200.200.200.200.
Heat rate (K/min) 3.4.2.2.
Initial hold (min) 5.2.
Final hold (min) 20.
I 1591.1581.1546.1549.
ReferenceWong and Tie, 1993Wyllie, Cook, et al., 1987Toda, Yamaguchi, et al., 1982Toda, Yamaguchi, et al., 1982
Comment MSDC-RI MSDC-RI MSDC-RI MSDC-RI

Normal alkane RI, non-polar column, custom temperature program

Data compiled by: NIST Mass Spectrometry Data Center, William E. Wallace, director

Column type CapillaryCapillaryCapillaryCapillaryCapillary
Active phase DB-5 MSDB-1RTX-1RTX-1CBP-5
Column length (m) 30.30.60.60.30.
Carrier gas HeliumHydrogenHeliumHeliumHelium
Substrate
Column diameter (mm) 0.250.250.220.220.25
Phase thickness (μm) 0.250.250.250.250.25
Program 70 0C 5 0C/min -> 120 0C 10 0C/min -> 280 0C (20 min)45 0C 3 0C/min -> 175 0C 15 0C/min -> 300 0C (10 min)not specifiednot specified60 0C 3 0C/min -> 240 0C 10 0C/min -> 280 0C (10 min)
I 1273.1265.1266.1266.1288.
ReferencePurushothaman and Ravi, 2013Albano, Lima, et al., 2012Bendiabdellah, El Amine Dib, et al., 2012Bendiabdellah, El Amine Dib, et al., 2012de Morais, Oliveira, et al., 2012
Comment MSDC-RI MSDC-RI MSDC-RI MSDC-RI MSDC-RI
Column type CapillaryCapillaryCapillaryCapillaryCapillary
Active phase Polydimethyl siloxane with 5 % Ph groupsHP-55 % Phenyl polydimethyl siloxaneOV-1OV-1
Column length (m) 30.25. 30.30.
Carrier gas HeliumHydrogen HeliumHelium
Substrate
Column diameter (mm) 0.250.32 0.250.25
Phase thickness (μm) 0.250.52
Program 50 0C 4 0C/min -> 200 0C (5 min) 20 0C/min -> 280 0Cnot specifiednot specified40 0C 2 0C/min -> 120 0C 10 0C/min -> 230 0C (15 min)40 0C 2 0C/min -> 120 0C 10 0C/min -> 230 0C (15 min)
I 1294.1289.1287.1259.1255.
Referenceda Silva, de Souza, et al., 2012Velickovic, Ristic, et al., 2012Chaverri, Diaz, et al., 2011Chen and Li, 2011Chen and Li, 2011
Comment MSDC-RI MSDC-RI MSDC-RI MSDC-RI MSDC-RI
Column type CapillaryCapillaryCapillaryCapillaryCapillary
Active phase HP-5 DB-5HP-5 MSHP-5 MS
Column length (m) 30. 60.
Carrier gas Helium Helium
Substrate
Column diameter (mm) 0.32 0.25
Phase thickness (μm) 0.25 1.00
Program not specifiednot specified40 0C 4 0C/min -> 230 0C 100 0C/min -> 260 0C (11.7 min)not specifiednot specified
I 1289.1283.1294.1285.1286.
ReferenceKahriman, Tosun, et al., 2011Karimi, Farmany, et al., 2011Miyazaki, Plotto, et al., 2011Payo, Colo, et al., 2011Payo, Colo, et al., 2011
Comment MSDC-RI MSDC-RI MSDC-RI MSDC-RI MSDC-RI
Column type CapillaryCapillaryCapillaryCapillaryCapillary
Active phase HP-5HP-5 MSDB-5DB-1-MSHP-5 MS
Column length (m) 30.30.30.60.30.
Carrier gas HeliumHeliumHeliumHeliumHelium
Substrate
Column diameter (mm) 0.250.250.200.250.25
Phase thickness (μm) 0.250.250.320.250.25
Program 60 0C (1 min) 10 0C/min -> 180 0C (1 min) 20 0C/min -> 280 0C (15 min)50 0C (1.5 min) 10 0C/min -> 180 0C (2 min) 6 0C/min -> 280 0C (10 min)60 0C (1 min) 3 0C/min -> 140 0C 50 0C/min -> 250 0C (3 min)not specified40 0C (5 min) 2 0C/min -> 270 0C -> 260 0C (20 min)
I 1287.1289.1285.1268.1284.
ReferenceWang, Liu, et al., 2011Wang, Xu, et al., 2011Nezhadali and Parsa, 2010Takeoka, Hobbs, et al., 2010Mancini, Arnold, et al., 2009
Comment MSDC-RI MSDC-RI MSDC-RI MSDC-RI MSDC-RI
Column type CapillaryCapillaryCapillaryCapillaryCapillary
Active phase DB-1DB-5OV-1HP-5 MSSLB-5 MS
Column length (m) 30.30.30.30.30.
Carrier gas HydrogenHeliumHeliumHeliumHelium
Substrate
Column diameter (mm) 0.250.250.250.250.25
Phase thickness (μm) 0.250.25 0.250.25
Program 45 0C 3 0C/min -> 175 0C 15 0C/min -> 300 0C (10 min)50 0C 95 min) 3 0C/min -> 100 0C 4 0C/min -> 160 0C 5 0C/min -> 220 0C (15 min)40 0C 2 0C/min -> 130 0C (5 min) 10 0C/min -> 230 0C (15 min)32 0C (1 min) 50 0C/min -> 115 0C 1.5 0C/min -> 145 0C 12 0C/min -> 240 0C (10 min)50 0C 3 0C/min -> 250 0C (1 min) 10 0C/min -> 300 0C (5 min)
I 1265.1285.1257.1285.1285.
ReferenceMendes, Trindade, et al., 2009Yang, Yang, et al., 2009Yu, Li, et al., 2009Zellner, Amorim, et al., 2009Costa, De Fina, et al., 2008
Comment MSDC-RI MSDC-RI MSDC-RI MSDC-RI MSDC-RI
Column type CapillaryCapillaryCapillaryCapillaryCapillary
Active phase SLB-5 MSCB-1CB-1CP Sil 8 CBSLB-5 MS
Column length (m) 30.30.30.50.30.
Carrier gas HeliumHeliumHeliumHeliumHelium
Substrate
Column diameter (mm) 0.250.250.250.320.25
Phase thickness (μm) 0.250.250.250.250.25
Program not specified40 0C (2 min) 4 0C/min -> 180 0C 20 0C/min -> 220 0C (1 min)not specifiednot specifiednot specified
I 1287.1263.1270.1289.1285.
ReferenceCosta, De Fina, et al., 2008Kannaste, Vongvanich, et al., 2008Kannaste, Vongvanich, et al., 2008Kupcinskiene, Stikliene, et al., 2008Lo Presti, Sciarrone, et al., 2008
Comment MSDC-RI MSDC-RI MSDC-RI MSDC-RI MSDC-RI
Column type CapillaryCapillaryCapillaryCapillaryCapillary
Active phase Elite-1RTX-5RTX-5DB-5MSCBP-5
Column length (m) 30.30.30.30.30.
Carrier gas HeliumHeliumHeliumHeHe
Substrate
Column diameter (mm) 0.320.250.250.250.25
Phase thickness (μm) 0.250.250.250.250.25
Program not specified60 0C (5 min) 5 0C/min -> 110 0C 3 0C/min -> 220 0C (5 min)not specified60C => 1C/min => 65C => 3C/min => 120C => 5C/min => 180C(5min) => 5C/min => 250C (20min)60C(2min) => 3C/min => 240C => 10C/min => 300C
I 1289.1286.1267.1285.1270.
ReferenceRaj, Baby, et al., 2008Zachariah, Leela, et al., 2008Zachariah, Leela, et al., 2008Barra A., Coroneo V., et al., 2007Cheriti, Saad, et al., 2007
Comment MSDC-RI MSDC-RI MSDC-RI MSDC-RI MSDC-RI
Column type CapillaryCapillaryCapillaryCapillaryCapillary
Active phase HP-5MSHP-5MSDB-1DB-5BPX-5
Column length (m) 30.30.30.50.30.
Carrier gas HeHeH2HeliumHe
Substrate
Column diameter (mm) 0.250.250.250.320.25
Phase thickness (μm) 0.250.250.250.250.25
Program 40C => 3C/min => 100C => 5C/min => 230C(2min)40C(10min) => 3C/min => 200C => 2C/min => 220C45 0C 3 0C/min -> 175 0C 15 0C/min -> 300 0C (10 min)60 0C (1 min) 5 0C/min -> 160 0C 10 0C/min -> 250 0C50C => 3C/min => 150C(10min) => 10C/min => 250C
I 1286.1281.1265.1289.1235.
ReferenceChokeprasert P., Charles A.L., et al., 2007Cole, Haber, et al., 2007Kamatou, Viljoen, et al., 2007Nivinsliene, Butkiene, et al., 2007Ozer H., Sokmen M., et al., 2007
Comment MSDC-RI MSDC-RI MSDC-RI MSDC-RI MSDC-RI
Column type CapillaryCapillaryCapillaryCapillaryCapillary
Active phase CP Sil 8 CBHP-5BPX-55 % Phenyl methylsiloxaneHP-5 MS
Column length (m) 50.30.30. 30.
Carrier gas HeliumHeliumHe Helium
Substrate
Column diameter (mm) 0.320.250.25 0.25
Phase thickness (μm) 0.250.250.25
Program 60 0C (2 min) 5 0C/min -> 160 0C (1 min) 10 0C/min -> 280 0C (3 min)not specified50C => 3C/min => 150C(10min) => 10C/min => 250Cnot specified40 0C (10 min) 3 oC/min -> 200 0C 2 0C/min -> 220 0C
I 1289.1289.1234.1302.1288.
ReferenceRadusiene, Judzentiene, et al., 2007Ristic, Krivokuca-Dokic, et al., 2007Salamci, Kordali, et al., 2007Serrano, Cornu, et al., 2007Setzer, Stokes, et al., 2007
Comment MSDC-RI MSDC-RI MSDC-RI MSDC-RI MSDC-RI
Column type CapillaryCapillaryCapillaryCapillaryCapillary
Active phase HP-5MSHP-5MSBPX-5HP-5MSDB-1
Column length (m) 30.30.30.30.30.
Carrier gas HeHeHeHeHe
Substrate
Column diameter (mm) 0.250.250.250.250.25
Phase thickness (μm)  0.250.250.250.25
Program 40C(10min) => 3C/min => 200C => 2C/min => 220C40C(3min) => 6C/min => 160C => 10C/min => 300C (10min)50C => 3C/min => 150C(10min) => 10C/min => 250C50C(2min) => 6C/min => 200C => 10C/min => 270C(10min)45C => 3C/min => 175C => 15C/min => 300C (10min)
I 1284.1288.1235.1302.1265.
ReferenceTakaku, Haber, et al., 2007Yu, Huang, et al., 2007Baris, Güllüce, et al., 2006Deng, Xu, et al., 2006Figueiredo A.C., Barroso J.G., et al., 2006
Comment MSDC-RI MSDC-RI MSDC-RI MSDC-RI MSDC-RI
Column type CapillaryCapillaryCapillaryCapillaryCapillary
Active phase HP-5MSHP-5HP-5HP-5HP-5
Column length (m) 30.30.30.30.30.
Carrier gas He  He
Substrate
Column diameter (mm) 0.250.250.250.250.25
Phase thickness (μm) 0.250.250.250.250.25
Program 40C(5min) => 2C/min => 250C(15min) => 10C/min => 270C>2.5C/min => 180C => 100C/min => 250C (7.3min)>2.5C/min => 180C => 100C/min => 250C (7.3min)60C(4min) => 1C/min => 64C => 2.5C/min => 155C => 5C/min => 250Cnot specified
I 1284.1312.1275.1302.1302.
ReferenceFormisano C., Senatore F., et al., 2006Goodner, Mahattanatawee, et al., 2006Goodner, Mahattanatawee, et al., 2006Jordan, Martinez, et al., 2006Martinez, Madrid, et al., 2006
Comment MSDC-RI MSDC-RI MSDC-RI MSDC-RI MSDC-RI
Column type CapillaryCapillaryCapillaryCapillaryCapillary
Active phase BPX-5HP-5MSSE-52DB-1DB-5MS
Column length (m) 30.30.30.30.30.
Carrier gas HeHeHeHe
Substrate
Column diameter (mm) 0.250.250.320.250.25
Phase thickness (μm) 0.250.250.150.250.25
Program 50C => 3C/min => 150C (10min) => 10C/min => 250C60C => 1.5C/min => 185C(1min) => 9C/min => 275C(2min)45C => 1C/min => 100C => 5C/min => 250C (10min)35C => 2C/min => 200C => 5C/min => 240C70C(2min) => 10C/min => 150C(15min) => 5C/min => 240C
I 1234.1289.1289.1259.1274.
ReferenceOzer H., Kilic H., et al., 2006Singh, Marimuthu, et al., 2006Tognolini, Barocelli, et al., 2006Al-Burtamani, Fatope, et al., 2005Bagci and Baser, 2005
Comment MSDC-RI MSDC-RI MSDC-RI MSDC-RI MSDC-RI
Column type CapillaryCapillaryCapillaryCapillaryCapillary
Active phase CP Sil 8 CBHP-5MSDB-5CP Sil 8 CBDB-1
Column length (m) 50.30.30.50.
Carrier gas HeHeHeHe
Substrate
Column diameter (mm) 0.320.250.250.32
Phase thickness (μm) 0.250.250.250.25
Program 50C(5min) => 2C/min => 90C => 15C/min => 240C(4min)50C => 8C/min => 200C => 10C/min => 270C (5min)40C(1min) => 9C/min => 130C => 2C/min => 230C60C(1min) => 5C/min => 160C => 5C/min => 250C(3min)not specified
I 1288.1291.1275.1285.1283.
ReferenceButkienë, Nivinskienë, et al., 2005Deng, Yao, et al., 2005Hamm, Bleton, et al., 2005Nivinskienë, Butkienë, et al., 2005Omidbaigi and Bastan, 2005
Comment MSDC-RI MSDC-RI MSDC-RI MSDC-RI MSDC-RI
Column type CapillaryCapillaryCapillaryCapillaryCapillary
Active phase CP Sil 8 CBCP Sil 8 CBMethyl Silicone OV-1
Column length (m) 50.50.  30.
Carrier gas HeHe  He
Substrate
Column diameter (mm) 0.320.32  0.25
Phase thickness (μm) 0.250.25  0.25
Program 60C(2min) => 5C/min => 160C(1min) => 10C/min => 250C (3min)50C(5min) => 2C/min => 90C => 15C/min => 240C(4min)not specifiednot specified45 0C (4 min) 3 0C/min -> 75 0C 4 0C/min -> 115 0C 6 0C/min -> 312 0C
I 1285.1288.1282.1253.1268.
ReferenceRadudienë, Judpintienë, et al., 2005Butkienë, Nivinskienë, et al., 2004Couladis, Özcan, et al., 2004El-Shazily, Hafez, et al., 2004Hafez and Abdel-Salam, 2004
Comment MSDC-RI MSDC-RI MSDC-RI MSDC-RI MSDC-RI
Column type CapillaryCapillaryCapillaryCapillaryCapillary
Active phase DB-5CP Sil 8 CBDB-1HP-5MSHP-5
Column length (m) 30.50.30.30.30.
Carrier gas HeHeHeHe
Substrate
Column diameter (mm) 0.250.320.250.250.25
Phase thickness (μm) 0.25 0.250.250.25
Program 40C(1min) => 9C/min => 130C => 2C/min => 230C60C(2min) => 5C/min => 160C (1min) => 10C/min => 250C (2min)45C => 3C/min => 175C => 15C/min => 300C (10min)50C(3min) => 3C/min => 150C(10min) => 10C/min => 250C40C(5min) => 2C/min => 250C(15min) => 10C/min => 270C
I 1275.1285.1265.1289.1284.
ReferenceHamm, Bleton, et al., 2004Judpentienë and Mockutë, 2004Miguel, Simões, et al., 2004Sahin, Gulluce, et al., 2004Senatore, Apostolides Arnold, et al., 2004
Comment MSDC-RI MSDC-RI MSDC-RI MSDC-RI MSDC-RI
Column type CapillaryCapillaryCapillaryCapillaryCapillary
Active phase HP-5HP-5SE-30DB-1DB-5
Column length (m) 30.30. 30.30.
Carrier gas HeHe HeHe
Substrate
Column diameter (mm) 0.250.25 0.250.25
Phase thickness (μm) 0.250.25 0.250.25
Program 60C(4min) => 1C/min => 64C => 2.5C/min => 155C => 5C/min => 250C50C (3min) => 3C/min => 150C (10min) => 10C/min => 250Cnot specified45C => 3C/min => 175C => 15C/min => 300C (10min)40C (1min) => 9C/min => 130C => 2C/min => 230C
I 1302.1289.1272.1265.1275.
ReferenceSotomayor, Martínez, et al., 2004Tepe, Donmez, et al., 2004Vinogradov, 2004Faleiro, Miguel, et al., 2003Hamm, Lesellier, et al., 2003
Comment MSDC-RI MSDC-RI MSDC-RI MSDC-RI MSDC-RI
Column type CapillaryCapillaryCapillaryCapillaryCapillary
Active phase HP-5CP Sil 8 CBDB-1SE-54CP Sil 8 CB
Column length (m) 30.50.30. 50.
Carrier gas HeHeHe He
Substrate
Column diameter (mm) 0.250.320.25 0.32
Phase thickness (μm) 0.250.250.1
Program 60C (4min) => 1C/min => 64C => 2.5C/min => 155C => 5C/min => 250C60C(1min) => 5C/min => 160C => 10C/min => 250C(5min)35C => 4C/min => 180C => 10C/min => 250Cnot specified60C(2min) => 5C/min => 160C(1min) => 10C/min => 250C (2min)
I 1302.1285.1271.1279.1285.
ReferenceJordán, Martínez, et al., 2003Mockute, Nivinskiene, et al., 2003Silva, Matos, et al., 2003Kilic, 2002Mockute and Judzentiene, 2002
Comment MSDC-RI MSDC-RI MSDC-RI MSDC-RI MSDC-RI
Column type CapillaryCapillaryCapillaryCapillaryCapillary
Active phase CP Sil 8 CBHP-1HP-5MSDB-1CBP-1
Column length (m) 50.30.30.30.25.
Carrier gas HeHeHe Nitrogen
Substrate
Column diameter (mm) 0.320.320.250.250.25
Phase thickness (μm)  0.250.250.250.25
Program 60C(2min) => 5C/min => 160C(1min) => 10C/min => 250C(2min)40C(3min) => 5C/min => 180C => 15C/min => 240C(15min)40C (10min) => 3C/min => 120C => 10C/min => 250C (5min)45 0C 3 K/min -> 175 0C 15 K/min -> 300 0C (10 min)not specified
I 1285.1313.1285.1265.1264.
ReferenceMockute and Judzentiene, 2002, 2Nogueira and Romano, 2002Ansorena, Gimeno, et al., 2001Figueiredo, Miguel, et al., 2001Ly, Yamauchi, et al., 2001
Comment MSDC-RI MSDC-RI MSDC-RI MSDC-RI MSDC-RI
Column type CapillaryCapillaryCapillaryCapillaryCapillary
Active phase CP Sil 5 CBMethyl SiliconeDB-1OV-1CP Sil 5 CB
Column length (m) 25. 30.50.25.
Carrier gas   HeHeHe
Substrate
Column diameter (mm) 0.39 0.250.32
Phase thickness (μm)   0.250.250.39
Program not specifiednot specified45C => 3C/min => 175C => 15C/min => 240C (10min)1)50C(1min) => 4C/min => 180C => 2C/min => 250C(10min) 2)50C(1min) => 6C/min => 200C => 12C/min => 250C(5min)not specified
I 1270.1272.1265.1274.1271.
ReferenceWeyerstahl, Marschall, et al., 1999Zenkevich, 1999Baratta, Dorman, et al., 1998Kökdil, 1998Weyerstahl, Marschall, et al., 1998
Comment MSDC-RI MSDC-RI MSDC-RI MSDC-RI MSDC-RI
Column type CapillaryCapillaryCapillaryCapillaryCapillary
Active phase DB-1DB-5SPB-SulfurCP Sil 5 CBDB-1
Column length (m) 30. 30.25.30.
Carrier gas He HeN2H2
Substrate
Column diameter (mm) 0.25 0.32 0.25
Phase thickness (μm) 0.25 4. 0.25
Program 45C => 3C/min => 175C => 15C/min => 280Cnot specifiednot specifiednot specified45 0C 3 0C/min -> 175 0C 15 0C/min -> 240 0C (10 min)
I 1265.1282.1272.1273.1265.
ReferenceGaspar, Palma, et al., 1997Isidorov, Zenkevich, et al., 1997Mariaca, Berger, et al., 1997Weyerstahl, Marschall, et al., 1997Barroso, Figueiredo, et al., 1996
Comment MSDC-RI MSDC-RI MSDC-RI MSDC-RI MSDC-RI
Column type CapillaryCapillaryCapillaryCapillaryCapillary
Active phase HP-1DB-5DB-5DB-5OV-101
Column length (m) 24.30.30.30.
Carrier gas
Substrate
Column diameter (mm) 0.320.320.320.32
Phase thickness (μm) 0.251.1.1.
Program 60C(2min) => 4C/min => 120C => 2C/min => 220C (20min)0C(5min) => 60C/min => 60C (5min) => 4C/min => 250C (5min)0C(5min) => 60C/min => 60C (5min) => 4C/min => 250C (5min)0C(5min) => 60C/min => 60C (5min) => 4C/min => 250C (5min)not specified
I 1267.1279.1279.1283.1268.
ReferenceDung, Thanh, et al., 1996Storer, Elmore, et al., 1993Storer, Elmore, et al., 1993Storer, Elmore, et al., 1993De Pooter, Vermeesch, et al., 1989
Comment MSDC-RI MSDC-RI MSDC-RI MSDC-RI MSDC-RI

Van Den Dool and Kratz RI, polar column, custom temperature program

Data compiled by: NIST Mass Spectrometry Data Center, William E. Wallace, director

Column type CapillaryCapillaryCapillary
Active phase BP-20HP-InnowaxHP-Innowax
Column length (m)  30.60.
Carrier gas  HeHe
Substrate
Column diameter (mm)  0.250.25
Phase thickness (μm)  0.250.25
Program not specified60C(8min) => 3C/min => 180C(5min) => 40C/min => 250C32C(1.5min) => 3C/min => 40C (10min) => 3C/min => 200C (10min)
I 1571.1580.1594.
ReferenceFilippini, Tomi, et al., 2000Bisio, Ciarallo, et al., 1998Iversen, Jakobsen, et al., 1998
Comment MSDC-RI MSDC-RI MSDC-RI

References

Belsito E.L., Carbone C., et al., 2007
Belsito E.L.; Carbone C.; Di Gioia M.L.; Leggio A.; Liguoiri A.; Perri F.; Siciliano C.; Viscomi M.C., Comparison of the volatile constituents in cold-pressed bergamot oil and a volatile oil isolated by vacuum distillation, J. Agric. Food Chem., 2007, 55, 19, 7847-7851, https://doi.org/10.1021/jf070997q . [all data]

Benkaci-Ali, Baaliouamer, et al., 2007
Benkaci-Ali, F.; Baaliouamer, A.; Meklati, B.Y.; Chemat, F., Chemical composition of seed essential oils from Algerian Nigella sativa extracted by microwave and hydrodistillation, Flavour Fragr. J., 2007, 22, 2, 148-153, https://doi.org/10.1002/ffj.1773 . [all data]

Dehghan, Solaimanian, et al., 2007
Dehghan, G.; Solaimanian, R.; Shahverdi, A.R.; Amin, G.; Abdollahi, M.; Shafiee, A., Chemical composition and antimicrobial activity of essential oil of Ferula szovitsiana D.C., Flavour Fragr. J., 2007, 22, 3, 224-227, https://doi.org/10.1002/ffj.1789 . [all data]

Duquesnoy, Castola, et al., 2007
Duquesnoy, E.; Castola, V.; Casanova, J., Composition and chemical variability of the twig oil of Abies alba Miller from Corsica, Flavour Fragr. J., 2007, 22, 4, 293-299, https://doi.org/10.1002/ffj.1796 . [all data]

Kundakovic, Fokialakis, et al., 2007
Kundakovic, T.; Fokialakis, N.; Kovacevic, N.; Chinou, I., Essential oil composition of Achillea lingulata and A. umbellata, Flavour Fragr. J., 2007, 22, 3, 184-187, https://doi.org/10.1002/ffj.1778 . [all data]

Lesueur, de Rocca Serra, et al., 2007
Lesueur, D.; de Rocca Serra, D.; Bighelli, A.; Hoi, T.M.; Ban, N.K.; Thai, T.H.; Casanova, J., Chemical composition and antibacterial activity of the essential oil of Michelia foveolata Merryll ex Dandy from Vietnam, Flavour Fragr. J., 2007, 22, 4, 317-321, https://doi.org/10.1002/ffj.1799 . [all data]

Muselli, Rossi, et al., 2007
Muselli, A.; Rossi, P.-G.; Desjobert, J.-M.; Bernardini, A.-F.; Berti, L.; Costa, J., Chemical composition and antibacterial activity of Otanthus maritimus (L.) Hoffmanns. Link essential oils from Corsica, Flavour Fragr. J., 2007, 22, 3, 217-223, https://doi.org/10.1002/ffj.1787 . [all data]

Paolini J., Costa J., et al., 2007
Paolini J.; Costa J.; Bernardini A.F., Analysis of the essential oil from the roots of Eupatorium cannabinum subsp corsicum (L.) by GC, GC-MS and C-13-NMR, Phytochem. Anal., 2007, 18, 3, 235-244, https://doi.org/10.1002/pca.977 . [all data]

Paolini, Muselli, et al., 2007
Paolini, J.; Muselli, A.; Bernardini, A.-F.; Bighelli, A.; Casanova, J.; Costa, J., Thymol derivatives from essential oil of Doronicum corsicum L., Flavour Fragr. J., 2007, 22, 6, 479-487, https://doi.org/10.1002/ffj.1824 . [all data]

Politeo, Jukic, et al., 2007
Politeo, O.; Jukic, M.; Milos, M., Chemical composition and antioxidant capacity of free volatile aglycones from basil (Ocimum basilicum L.) compared with its essential oil, Food Chem., 2007, 101, 1, 379-385, https://doi.org/10.1016/j.foodchem.2006.01.045 . [all data]

Radulovic, Lazarevic, et al., 2007
Radulovic, N.; Lazarevic, J.; Ristic, N.; Palic, R., Chemotaxonomic significance of the volatiles in the genus Stachys (Lamiaceae): Essential oil composition of four Balkan Stachys species, Biochem. Syst. Ecol., 2007, 35, 4, 196-208, https://doi.org/10.1016/j.bse.2006.10.010 . [all data]

Simoniatto, Bonani, et al., 2007
Simoniatto, E.; Bonani, V.F.L.; Morel, A.F.; Poppi, N.R.; Raposo, J.L., Jr.; Stuker, C.Z.; Peruzzo, G.M.; Peres, M.T.L.P.; Hess, S.C., Chemical composition and evaluation of antibacterial and antioxidant activities of the essential oil of Croton urucurana Baillon (Euphorbiaceae) stem bark, J. Braz. Chem., 2007, 18, 5, 879-885, https://doi.org/10.1590/S0103-50532007000500002 . [all data]

Vagionas, Ngassapa, et al., 2007
Vagionas, K.; Ngassapa, O.; Runyoro, D.; Graikou, K.; Gortzi, O.; Chinou, I., Chemical analysis of edible aromatic plants growing in Tanzania, Food Chem., 2007, 105, 4, 1711-1717, https://doi.org/10.1016/j.foodchem.2007.05.029 . [all data]

Yu, Liao, et al., 2007
Yu, J.Q.; Liao, Z.X.; Cai, X.Q.; Lei, J.C.; Zou, G.L., Composition, antimicrobial activity and cytotoxicity of essential oils from Aristolochia mollissima, Environmental Toxicology and Pharmacology, 2007, 23, 2, 162-167, https://doi.org/10.1016/j.etap.2006.08.004 . [all data]

Andrianoelisoa H.S., Menut C., et al., 2006
Andrianoelisoa H.S.; Menut C.; de Chatelperron P.C.; Saracco J.; Ramanoelina P.; Danthu P., Intraspecific chemical variability and highlighting of chemotypes of leaf essential oils from Ravensara aromatica Sonnerat a tree endemic to Madagascar, Flavour Fragr. J., 2006, 21, 5, 833-838, https://doi.org/10.1002/ffj.1735 . [all data]

Blagojevic, Radulovic, et al., 2006
Blagojevic, P.; Radulovic, N.; Palic, R.; Stojanovic, G., Chemical composition of the essential oils of Serbian wild-growing Srtemisia absinthium and Artemisia vulgaris, J. Agric. Food Chem., 2006, 54, 13, 4780-4789, https://doi.org/10.1021/jf060123o . [all data]

Boti, Bighelli, et al., 2006
Boti, J.B.; Bighelli, A.; Cavaleiro, C.; Salgueiro, L.; Casanova, J., Chemical variability of Juniperus oxycedrus ssp. oxycedrus berry and leaf oils from Corsica, analysed by combination of GC, GC-MS and 13C-NMR, Flavour Fragr. J., 2006, 21, 2, 268-273, https://doi.org/10.1002/ffj.1579 . [all data]

Cavalli, Tomi, et al., 2006
Cavalli, J.-F.; Tomi, F.; Bernardini, A.-F.; Casanova, J., Chemical variability of the essential oil of Helichrysum faradifani Sc. Ell. from Madagascar, Flavour Fragr. J., 2006, 21, 1, 111-114, https://doi.org/10.1002/ffj.1531 . [all data]

Djarri, Medjroubi, et al., 2006
Djarri, L.; Medjroubi, K.; Akkal, S.; Elomri, A.; Seguin, E.; Vérité, P., Composition of the essential oil of aerial parts of an endemic species of the Apiaceae of Algeria, Daucus reboudii Coss., Flavour Fragr. J., 2006, 21, 4, 647-649, https://doi.org/10.1002/ffj.1636 . [all data]

Dob, Dahmane, et al., 2006
Dob, T.; Dahmane, D.; Chelghoum, C., Essential oil composition of Juniperus oxycedrus growing in Algeria, Pharm. Biol., 2006, 44, 1, 1-6, https://doi.org/10.1080/13880200500530922 . [all data]

Dob, Dahmane, et al., 2006, 2
Dob, T.; Dahmane, D.; Agli, M.; Chelghoum, C., Essential oil composition of Lavandula stoechas from Algeria, Pharm. Biol., 2006, 44, 1, 60-64, https://doi.org/10.1080/13880200500496421 . [all data]

Duquesnoy, Dinh, et al., 2006
Duquesnoy, E.; Dinh, N.H.; Castola, V.; Casanova, J., Composition of a Pyrolytic oil from Cupressus funebris Endl. of Vietnamese origin, Flavour Fragr. J., 2006, 21, 3, 453-457, https://doi.org/10.1002/ffj.1676 . [all data]

Esmaeili, Nematollahi, et al., 2006
Esmaeili, A.; Nematollahi, F.; Rustaiyan, A.; Moazami, N.; Masoudi, S.; Bamasian, S., Volatile constituents of Achillea pachycephala, A. oxyodonta and A. biebersteinii from Iran, Flavour Fragr. J., 2006, 21, 2, 253-256, https://doi.org/10.1002/ffj.1571 . [all data]

Gonny, Cavaleiro, et al., 2006
Gonny, M.; Cavaleiro, C.; Salgueiro, L.; Casanova, J., Analysis of Juniperus communis subsp. alpina needle, berry, wood and root oils by combination of GC, GC/MS and 13C-NMR, Flavour Fragr. J., 2006, 21, 1, 99-106, https://doi.org/10.1002/ffj.1527 . [all data]

Javidnia, Miri, et al., 2006
Javidnia, K.; Miri, R.; Banani, A., Volatile oil constituents of Haplophyllum tuberculatum (Forssk.) A. Juss. (Rutaceae) from Iran, J. Essent. Oil Res., 2006, 18, 4, 355-356, https://doi.org/10.1080/10412905.2006.9699111 . [all data]

Javidnia, Miri, et al., 2006, 2
Javidnia, K.; Miri, R.; Kamalinejad, M.; Khazraii, H., Chemical composition of the volatile oil of aerial parts of Valeriana sisymbriifolia Vahl. grown in Iran, Flavour Fragr. J., 2006, 21, 3, 516-518, https://doi.org/10.1002/ffj.1660 . [all data]

Kallio, Jussila, et al., 2006
Kallio, M.; Jussila, M.; Rissanen, T.; Anttila, P.; Hartonen, K.; Reissell, A.; Vreuls, R.; Adahchour, M.; Hyotylainen, T., Comprehensive two-dimensional gas chromatography coupled to time-of-flight mass spectrometry in the identification of organic compounds in atmospheric aerosols from coniferous forest, J. Chromatogr. A, 2006, 1125, 2, 234-243, https://doi.org/10.1016/j.chroma.2006.05.050 . [all data]

Kuiate, Bessière, et al., 2006
Kuiate, J.R.; Bessière, J.M.; Vilarem, G.; Amvam Zollo, P.H., Chemical composition and antidermatophytic properties of the essential oils from leaves, flowers and fruits of Cupressus lusitanica Mill. from Cameroon, Flavour Fragr. J., 2006, 21, 4, 693-697, https://doi.org/10.1002/ffj.1686 . [all data]

Masoudi, Esmaeili, et al., 2006
Masoudi, S.; Esmaeili, A.; Khalilzadeh, M.A.; Rustaiyan, A.; Moazami, N.; Akhgar, M.R.; Varavipoor, M., Volatile constituents of Dorema aucheri Boiss., Seseli libanotis (L.) W. D. Koch var. armeniacum bordz. and Conium maculatum L. three Umbelliferae herbs growing wild in Iran, Flavour Fragr. J., 2006, 21, 5, 801-804, https://doi.org/10.1002/ffj.1722 . [all data]

Pinto, Pina-Vaz, et al., 2006
Pinto, E.; Pina-Vaz, C.; Salgueiro, L.; Goncalves, M.J.; Costa-de-Oliveira, S.; Cavaleiro, C.; Palmeira, A.; Rodrigues, A.; Martinez-de-Oliveira, J., Antifuncal activity of the essential oil Thymus pulegioides on Candida, Aspergillus and dermatophyte species, Journal of Medical Microbiology, 2006, 55, 10, 1367-1373, https://doi.org/10.1099/jmm.0.46443-0 . [all data]

Radulovic, Mananjarasoa, et al., 2006
Radulovic, N.; Mananjarasoa, E.; Harinantenaina, L.; Yoshinori, A., Essential oil composition of four Croton species from Madagascar and their chemotaxonomy, Biochem. Syst. Ecol., 2006, 34, 8, 648-653, https://doi.org/10.1016/j.bse.2006.02.005 . [all data]

Salgueiro L.R., Pinto E., et al., 2006
Salgueiro L.R.; Pinto E.; Goncalves M.J.; Costa I.; Palmeira A.; Cavaleiro C.; Pina-Vaz C.; Rodrigues A.G.; Martinez-De-Oliveira J., Antifungal activity of the essential oil of Thymus capitellatus against Candida, Aspergillus and dermatophyte strains, Flavour Fragr. J., 2006, 21, 5, 749-753, https://doi.org/10.1002/ffj.1610 . [all data]

Saroglou, Dorizas, et al., 2006
Saroglou, V.; Dorizas, N.; Kypriotakis, Z.; Skaltsa, H.D., Analysis of the essential oil composition of eight Anthemis species from Greece, J. Chromatogr. A, 2006, 1104, 1-2, 313-322, https://doi.org/10.1016/j.chroma.2005.11.087 . [all data]

Su, Ho, et al., 2006
Su, Y.C.; Ho, C.L.; Wang, E.I.C., Analysis of leaf essential oils from the indigenous five conifers of Taiwan, Flavour Fragr. J., 2006, 21, 3, 447-452, https://doi.org/10.1002/ffj.1685 . [all data]

Boskovic, Radulovic, et al., 2005
Boskovic, Z.; Radulovic, N.; Stojanovic, G., Essential oil composition of four Achillea species from the balkans and its chemotaxonomic significance, Chem. Nat. Compd. (Engl. Transl.), 2005, 41, 6, 674-678, https://doi.org/10.1007/s10600-006-0009-6 . [all data]

Boti J.B., Koukoua G., et al., 2005
Boti J.B.; Koukoua G.; N'Guessan T.Y.; Muselli A.; Bernardini A.F.; Casanova J., Composition of the leaf, stem bark and root bark oils of Isolona cooperi investigated by GC (retention index), GC-MS and C-13-NMR spectroscopy, Phytochem. Anal., 2005, 16, 5, 357-363, https://doi.org/10.1002/pca.857 . [all data]

Brantner, Pfeifhofer, et al., 2005
Brantner, A.H.; Pfeifhofer, H.W.; Ercegovac, O.; Males, Z.; Plazibat, M., Essential oil composition and antioxidant activity of Thymus bracteosus Vis. ex Benth., Flavour Fragr. J., 2005, 20, 6, 596-600, https://doi.org/10.1002/ffj.1494 . [all data]

Cozzani, Muselli, et al., 2005
Cozzani, S.; Muselli, A.; Desjobert, J.-M.; Bernardini, A.-F.; Tomi, F.; Casanova, J., Chemical composition of essential oil of Teucrium polium subsp. capitatum (L.) from Corsica, Flavour Fragr. J., 2005, 20, 4, 436-441, https://doi.org/10.1002/ffj.1463 . [all data]

Dob, Berramdane, et al., 2005
Dob, T.; Berramdane, T.; Dahmane, D.; Chelghoum, C., Chemical composition of the needles oil of Pinus canariensis from Algeria, Chem. Nat. Compd. (Engl. Transl.), 2005, 41, 2, 165-167, https://doi.org/10.1007/s10600-005-0103-1 . [all data]

Dob, Dahmane, et al., 2005
Dob, T.; Dahmane, D.; Berramdane, T.; Chelghoum, C., Chemical composition of the essential oil of Artemisia campestris L. from Algeria, Pharm. Biol., 2005, 43, 6, 512-514, https://doi.org/10.1080/13880200500220664 . [all data]

Ferrari, Tomi, et al., 2005
Ferrari, B.; Tomi, F.; Casanova, J., Composition and chemical variability of Ferula communis essential oil from Corsica, Flavour Fragr. J., 2005, 20, 2, 180-185, https://doi.org/10.1002/ffj.1405 . [all data]

Idzojtic, Kajba, et al., 2005
Idzojtic, M.; Kajba, D.; Franjic, J., Differentiation of F1 hybrids P. nigra J. F. Arnold × P. sylvestris L., P. nigra J. F. Arnold × P. densiflora Siebold et Zucc., P. nigra J. F. Arnold × P. thunbergiana Franco and their parental species by needle volatile composition, Biochem. Syst. Ecol., 2005, 33, 4, 427-439, https://doi.org/10.1016/j.bse.2004.10.008 . [all data]

Mahattanatawee, Goodner, et al., 2005
Mahattanatawee, K.; Goodner, K.L.; Baldwin, E.A., Volatile constituents and character impact compounds of selected Florida's tropical fruit, Proc. Fla. State Hort. Soc., 2005, 118, 414-418. [all data]

Paolini, Costa, et al., 2005
Paolini, J.; Costa, J.; Bernardini, A., Analysis of the essential oil from aerial parts of Eupatorium cannabinum subsp. corsicum (L.) by gas chromatography with electron impact and chemical ionization mass spectrometry, J. Chromatogr. A, 2005, 1076, 1-2, 170-178, https://doi.org/10.1016/j.chroma.2005.03.131 . [all data]

Pino, Mesa, et al., 2005
Pino, J.A.; Mesa, J.; Muñoz, Y.; Martí, M.P.; Marbot, R., Volatile components from mango (Mangifera indica L.) cultivars, J. Agric. Food Chem., 2005, 53, 6, 2213-2223, https://doi.org/10.1021/jf0402633 . [all data]

Sati and Mathela, 2005
Sati, S.; Mathela, C.S., Essential oil composition of Valeriana hardwickii var. arnottiana from the Himalayas, Flavour Fragr. J., 2005, 20, 3, 299-301, https://doi.org/10.1002/ffj.1415 . [all data]

Senatore, Napolitano, et al., 2005
Senatore, F.; Napolitano, F.; Arnold, N.A.; Bruno, M.; Herz, W., Composition and antimicrobial activity of the essential oil of Achillea falcata L. (Asteraceae), Flavour Fragr. J., 2005, 20, 3, 291-294, https://doi.org/10.1002/ffj.1411 . [all data]

Seo and Baek, 2005
Seo, W.H.; Baek, H.H., Identification of characteristic aroma-active compounds from water dropword (Oenanthe javanica DC.), J. Agric. Food Chem., 2005, 53, 17, 6766-6770, https://doi.org/10.1021/jf050150z . [all data]

Alma, Nitz, et al., 2004
Alma, M.H.; Nitz, S.; Kollmannsberger, H.; Digrak, M.; Efe, F.T.; Yilmaz, N., Chemical composition and antimicrobial activity of the essential oils from the gum of Turkish Pistachio (Pistacia vera L.), J. Agric. Food Chem., 2004, 52, 12, 3911-3914, https://doi.org/10.1021/jf040014e . [all data]

Antunes, Sevinate-Pinto, et al., 2004
Antunes, T.; Sevinate-Pinto, I.; Barroso, J.G.; Cavaleiro, C.; Salgueiro, L.R., Micromorphology of trichomes and composition of essential oil of Teucrium capitatum, Flavour Fragr. J., 2004, 19, 4, 336-340, https://doi.org/10.1002/ffj.1310 . [all data]

Gocmen, Gurbuz, et al., 2004
Gocmen, D.; Gurbuz, O.; Rouseff, R.L.; Smoot, J.M.; Dagdelen, A.F., Gas chromatographic-olfactometric characterization of aroma active compounds in sun-dried and vacuum-dried tarhana, Eur. Food Res. Technol., 2004, 218, 6, 573-578, https://doi.org/10.1007/s00217-004-0913-6 . [all data]

Gonny, Bradesi, et al., 2004
Gonny, M.; Bradesi, P.; Casanova, J., Identification of the components of the essential oil from wild Corsican Daucus carota L. using 13C-NMR spectroscopy, Flavour Fragr. J., 2004, 19, 5, 424-433, https://doi.org/10.1002/ffj.1330 . [all data]

Isidorov, Krajewska, et al., 2004
Isidorov, V.A.; Krajewska, U.; Vinogorova, V.T.; Vetchinnikova, L.V.; Fuksman, I.L.; Bal, K., Gas chromatographic analysis of essential oil from buds of different birch species with preliminary partition of components, Biochem. Syst. Ecol., 2004, 32, 1, 1-13, https://doi.org/10.1016/S0305-1978(03)00175-3 . [all data]

Javidnia, Miri, et al., 2004
Javidnia, K.; Miri, R.; Sadeghpour, H., Composition of the volatile oil of Achillea wilhelmsii C. Koch from Iran, DARU, 2004, 12, 2, 63-66, retrieved from http://www1.tums.ac.ir/daru/. [all data]

Mardarowicz, Wianowska, et al., 2004
Mardarowicz, M.; Wianowska, D.; Dawidowicz, A.L.; Sawicki, R., The influence of sample treatment on SPME extracts from conifers. I. Comparison of terpene composition in Engelmann Spruce (Picea engelmanii) using hydrodistillation, SPME and PLE, Annales Universitatis Mariae Curie-Sklodowska Lublin - Polonia, 2004, 59, 3, 25-42. [all data]

Moldão-Martins, Beirão-da-Costa, et al., 2004
Moldão-Martins, M.; Beirão-da-Costa, S.; Neves, C.; Cavaleiro, C.; Salgueiro, L.; Beirão-da-Costa, M.L., Olive oil flavoured by the essential oils of Mentha × piperita and Thymus mastichina L., Food Qual. Pref., 2004, 15, 5, 447-452, https://doi.org/10.1016/j.foodqual.2003.08.001 . [all data]

Mumm, Tiemann, et al., 2004
Mumm, R.; Tiemann, T.; Schulz, S.; Hilker, M., Analysis of volatiles from black pine (Pinus nigra): significance of wounding and egg deposition by a herbivorous sawfly, Phytochemistry, 2004, 65, 24, 3221-3230, https://doi.org/10.1016/j.phytochem.2004.10.010 . [all data]

Ramezani, Khaje-Karamoddin, et al., 2004
Ramezani, M.; Khaje-Karamoddin, M.; Karimi-Fard, V., Chemical composition and anti-Helicobacter pylori activity of the essential oil of Pistacia vera, Pharm. Biol., 2004, 42, 7, 488-490, https://doi.org/10.3109/13880200490891755 . [all data]

Salido, Valenzuela, et al., 2004
Salido, S.; Valenzuela, L.R.; Altarejos, J.; Nogueras, M.; Sánchez, A.; Cano, E., Composition and infraspecific variability of Artemisia herba-alba from southern Spain, Biochem. Syst. Ecol., 2004, 32, 3, 265-277, https://doi.org/10.1016/j.bse.2003.09.002 . [all data]

Tzakou, Vagias, et al., 2004
Tzakou, O.; Vagias, C.; Gani, A.; Yannitsaros, A., Volatile constituents of essential oils isolated at different growth stages from three Conyza species growing in Greece, Flavour Fragr. J., 2004, 19, 425-428. [all data]

Vérité, Nacer, et al., 2004
Vérité, P.; Nacer, A.; Kabouche, Z.; Seguin, E., Composition of seeds and stems essential oils of Pituranthos scoparius (Coss. Dur.) Schinz, Flavour Fragr. J., 2004, 19, 6, 562-564, https://doi.org/10.1002/ffj.1353 . [all data]

Yu, Kim, et al., 2004
Yu, E.J.; Kim, T.H.; Kim, K.H.; Lee, H.J., Aroma-active compounds of Pinus densiflora (red pine) needles, Flavour Fragr. J., 2004, 19, 6, 532-537, https://doi.org/10.1002/ffj.1337 . [all data]

Yu, Kim, et al., 2004, 2
Yu, E.J.; Kim, T.H.; Kim, K.H.; Lee, H.J., Characterization of aroma-active compounds of Abies nephrolepis (Khingan fir) needles using aroma extract dilution analysis, Flavour Fragr. J., 2004, 19, 1, 74-79, https://doi.org/10.1002/ffj.1314 . [all data]

Zheng, Kim, et al., 2004
Zheng, C.H.; Kim, T.H.; Kim, K.H.; Leem, Y.H.; Lee, H.J., Characterization of potent aroma compounds in Chrysanthemum coronarium L. (Garland) using aroma extract dilution analysis, Flavour Fragr. J., 2004, 19, 5, 401-405, https://doi.org/10.1002/ffj.1447 . [all data]

Angelini, Carpanese, et al., 2003
Angelini, L.G.; Carpanese, G.; Cioni, P.L.; Morelli, I.; Macchia, M.; Flamini, G., Essential oils from Mediterranean lamiaceae as weed germination inhibitors, J. Agric. Food Chem., 2003, 51, 21, 6158-6164, https://doi.org/10.1021/jf0210728 . [all data]

Cavaleiro, Salgueiro, et al., 2003
Cavaleiro, C.; Salgueiro, L.R.; da Cunha, A.P.; Figueiredo, A.C.; Barroso, J.G.; Bighelli, A.; Casanova, J., Composition and variability of the essential oils of the leaves and berries from Juniperus navicularis, Biochem. Syst. Ecol., 2003, 31, 2, 193-201, https://doi.org/10.1016/S0305-1978(02)00080-7 . [all data]

Cavalli, Tomi, et al., 2003
Cavalli, J.-F.; Tomi, F.; Bernardini, A.-F.; Casanova, J., Composition and chemical variability of the bark oil of Cedrelopsis grevei H. Baillon from Madagascar, Flavour Fragr. J., 2003, 18, 6, 532-538, https://doi.org/10.1002/ffj.1263 . [all data]

Javidnia, Miri, et al., 2003
Javidnia, K.; Miri, R.; Azarpira, A.; Tabaei, S.M.H., Composition of the essential oil of Stachys setifera C.A. Mey ssp. iranica growing in Iran, Flavour Fragr. J., 2003, 18, 4, 299-300, https://doi.org/10.1002/ffj.1165 . [all data]

Ngassapa, Runyoro, et al., 2003
Ngassapa, O.; Runyoro, D.K.B.; Harvala, E.; Chinou, I.B., Composition and antimicrobial activity of essential oils of two populations of Tanzanian Lippia javanica (Burm. f.) Spreng. (Verbenaceae), Flavour Fragr. J., 2003, 18, 3, 221-224, https://doi.org/10.1002/ffj.1195 . [all data]

Salido, Altarejos, et al., 2003
Salido, S.; Altarejos, J.; Nogueras, M.; Sánchez, A.; Luque, P., Chemical composition and seasonal variations of rosemary oil from Southern Spain, J. Essent. Oil Res., 2003, 15, 1, 10-14, https://doi.org/10.1080/10412905.2003.9712248 . [all data]

Shao, Marriott, et al., 2003
Shao, Y.; Marriott, P.; Shellie, R.; Hügel, H., Solid-phase micro-extraction-comprehensive two-dimensional gas chromatography of ginger (Zingiber officinale) volatiles, Flavour Fragr. J., 2003, 18, 1, 5-12, https://doi.org/10.1002/ffj.1133 . [all data]

Tzakou, Couladis, et al., 2003
Tzakou, O.; Couladis, M.; Slavkovska, V.; Mimica-Dukic, N.; Jancic, R., The essential oil composition of Salvia brachyodon Vandas, Flavour Fragr. J., 2003, 18, 1, 2-4, https://doi.org/10.1002/ffj.1132 . [all data]

Verzera, Trozzi, et al., 2003
Verzera, A.; Trozzi, A.; Gazea, F.; Cicciarelloi, G.; Cotroneo, A., Effects of rootstock on the composition of bergamot (Citrus bergamia Risso et Poiteau) essential oil, J. Agric. Food Chem., 2003, 51, 1, 206-210, https://doi.org/10.1021/jf0206872 . [all data]

Cavaleiro, Salgueiro, et al., 2002
Cavaleiro, C.; Salgueiro, L.R.; Antunes, T.; Sevinate-Pinto, I.; Barroso, J.G., Composition of the essential oil and micromorphology of trichomes of Teucrium salviastrum, an endemic species from Portugal, Flavour Fragr. J., 2002, 17, 4, 287-291, https://doi.org/10.1002/ffj.1068 . [all data]

Choi, Kim. M.-S.L., et al., 2002
Choi, H.-S.; Kim. M.-S.L.; Sawamura, M., Constituents of the essential oil of cnidium officinale Makino, a Korean medicinal plant, Flavour Fragr. J., 2002, 17, 1, 49-53, https://doi.org/10.1002/ffj.1038 . [all data]

Flamini, Cioni, et al., 2002
Flamini, G.; Cioni, P.L.; Morelli, I.; Macchia, M.; Ceccarini, L., Main agronomic-productive characteristics of two ecotypes of Rosmarinus officinalis L. and chemical composition of their essential oils, J. Agric. Food Chem., 2002, 50, 12, 3512-3517, https://doi.org/10.1021/jf011138j . [all data]

Fokialakis, Magiatis, et al., 2002
Fokialakis, N.; Magiatis, P.; Mitaku, S., Essential oil constituents of Valeriana italica and Valeriana tuberosa. Stereochemical and conformational study of 15-acetoxyvaleranone, Z. Naturforsch., 2002, 57c, 791-796. [all data]

Lota, de Rocca Serra, et al., 2002
Lota, M.-L.; de Rocca Serra, D.; Tomi, F.; Jacquemond, C.; Casanova, J., Volatile components of peel and leaf oils of lemon and lime species, J. Agric. Food Chem., 2002, 50, 4, 796-805, https://doi.org/10.1021/jf010924l . [all data]

Pino, Marbot, et al., 2002
Pino, J.A.; Marbot, R.; Quert, R.; García, H., Study of essential oils of Eucalyptus resinifera Smith, E. tereticornis Smith and Corymbia maculata (Hook.) K.D. Hill L.A.S. Johnson, grown in Cuba, Flavour Fragr. J., 2002, 17, 1, 1-4, https://doi.org/10.1002/ffj.1026 . [all data]

Pintore, Usai, et al., 2002
Pintore, G.; Usai, M.; Bradesi, P.; Juliano, C.; Boatto, G.; Tomi, F.; Chessa, M.; Cerri, R.; Casanova, J., Chemical composition and antimicrobial activity of Rosmarinus officinalis L. oils from Sardinia and Corsica, Flavour Fragr. J., 2002, 17, 1, 15-19, https://doi.org/10.1002/ffj.1022 . [all data]

Shellie, Mondello, et al., 2002
Shellie, R.; Mondello, L.; Marriott, P.; Dugo, G., Characterisation of lavender essential oils by using gas chromatography-mass spectrometry with correlation of linear retention indices and comparison with comprehensive two-dimensional gas chromatography, J. Chromatogr. A, 2002, 970, 1-2, 225-234, https://doi.org/10.1016/S0021-9673(02)00653-2 . [all data]

Aligiannis, Kalpoutzakis, et al., 2001
Aligiannis, N.; Kalpoutzakis, E.; Mitaku, S.; Chinou, I.B., Composition and antimicrobial activity of the essential oils of two Origanum species, J. Agric. Food Chem., 2001, 49, 9, 4168-4170, https://doi.org/10.1021/jf001494m . [all data]

Aligiannis, Kalpoutzakis, et al., 2001, 2
Aligiannis, N.; Kalpoutzakis, E.; Chinou, I.B.; Mitaku, S.; Gikas, E.; Tsarbopoulos, A., Composition and antimicrobial activity of the essential oils of five taxa of Sideritis from Greece, J. Agric. Food Chem., 2001, 49, 2, 811-815, https://doi.org/10.1021/jf001018w . [all data]

Couladis, Tsortanidou, et al., 2001
Couladis, M.; Tsortanidou, V.; Francisco-Ortega, J.; Santos-Guerra, A.; Harvala, C., Composition of the essential oils of Argyranthemum species growing in the Canary Islands, Flavour Fragr. J., 2001, 16, 2, 103-106, https://doi.org/10.1002/ffj.954 . [all data]

Couladis, Tzakou, et al., 2001
Couladis, M.; Tzakou, O.; Stojanovic, D.; Mimica-Dukic, N.; Jancic, R., The essential oil composition of Salvia argentea L., Flavour Fragr. J., 2001, 16, 3, 227-229, https://doi.org/10.1002/ffj.989 . [all data]

Giamakis, Kretsi, et al., 2001
Giamakis, A.; Kretsi, O.; Chinou, I.; Spyropoulos, C.G., Eucalyptus camaldulensis: volatiles from immature flowers and high production of 1,8-cineole and β-pinene by in vitro cultures, Phytochemistry, 2001, 58, 2, 351-355, https://doi.org/10.1016/S0031-9422(01)00193-5 . [all data]

Pino, Marbot, et al., 2001
Pino, J.A.; Marbot, R.; Vázquez, C., Characterization of volatiles in strawberry guava (Psidium cattleianum Sabine) fruit, J. Agric. Food Chem., 2001, 49, 12, 5883-5887, https://doi.org/10.1021/jf010414r . [all data]

Rezzi, Bighelli, et al., 2001
Rezzi, S.; Bighelli, A.; Mouillot, D.; Casanova, J., Composition and chemical variability of the needle essential oil of Pinus nigra subsp. laricio from corsica, Flavour Fragr. J., 2001, 16, 5, 379-383, https://doi.org/10.1002/ffj.1018 . [all data]

Salido, Altarejos, et al., 2001
Salido, S.; Altarejos, J.; Nogueras, M.; Sánchez, A., Chemical composition of the essential oil of Artemisia herba-alba Asso ssp. valentina (Lam.) Marcl., J. Essent. Oil Res., 2001, 13, 4, 221-224, https://doi.org/10.1080/10412905.2001.9699675 . [all data]

Skaltsa, Mavrommati, et al., 2001
Skaltsa, H.D.; Mavrommati, A.; Constantinidis, T., A chemotaxonomic investigation of volatile constituents in Stachys subsect. Swainsonianeae (Labiatae), Phytochemistry, 2001, 57, 2, 235-244, https://doi.org/10.1016/S0031-9422(01)00003-6 . [all data]

Bartley and Jacobs, 2000
Bartley, J.P.; Jacobs, A.L., Effects of drying on flavour compounds in Australian-grown ginger (Zingiber officinale), J. Sci. Food Agric., 2000, 80, 2, 209-215, https://doi.org/10.1002/(SICI)1097-0010(20000115)80:2<209::AID-JSFA516>3.0.CO;2-8 . [all data]

Kim, Thuy, et al., 2000
Kim, T.H.; Thuy, N.T.; Shin, J.H.; Baek, H.H.; Lee, H.J., Aroma-active compounds of miniature beefsteakplant (Mosla dianthera Maxim.), J. Agric. Food Chem., 2000, 48, 7, 2877-2881, https://doi.org/10.1021/jf000219x . [all data]

Milos and Radonic, 2000
Milos, M.; Radonic, A., Gas chromatography mass spectral analysis of free and glycosidically bound volatile compounds from Juniperus oxycedrus L. growing wild in Croatia, Food Chem., 2000, 68, 3, 333-338, https://doi.org/10.1016/S0308-8146(99)00192-2 . [all data]

Pfeifhofer, 2000
Pfeifhofer, H.W., Composition of the essential oil of Pinus canariensis Sweet ex Sprengel, Flavour Fragr. J., 2000, 15, 4, 266-270, https://doi.org/10.1002/1099-1026(200007/08)15:4<266::AID-FFJ908>3.0.CO;2-E . [all data]

Verzera, la Rosa, et al., 2000
Verzera, A.; la Rosa, G.; Zappalà, M.; Cotroneo, A., Essential oil composition of different cultivars of bergamot grown in Sicily, Ital. J. Food Sci., 2000, 12, 4, 493-501. [all data]

Mazzoni, Tomi, et al., 1999
Mazzoni, V.; Tomi, F.; Casanova, J., A daucane-type sesquiterpene from Faucus carota seed oil, Flavour Fragr. J., 1999, 14, 5, 268-272, https://doi.org/10.1002/(SICI)1099-1026(199909/10)14:5<268::AID-FFJ823>3.0.CO;2-Z . [all data]

Mirza and Sefidkon, 1999
Mirza, M.; Sefidkon, F., Essential oil composition of two Salvia species from Iran, Salvia nemorosa L. and Salvia reuterana Boiss., Flavour Fragr. J., 1999, 14, 4, 230-232, https://doi.org/10.1002/(SICI)1099-1026(199907/08)14:4<230::AID-FFJ816>3.0.CO;2-L . [all data]

Stashenko, Cervantes, et al., 1999
Stashenko, E.E.; Cervantes, M.; Combariza, Y.; Fuentes, H.; Martínez, J.R., HRGC/FID and HRGC/MSD analysis of the secondary metabolites obtained by different extraction methods from Lepechinia schiedeana, an in vitro evaluation of its antioxidant activity, J. Hi. Res. Chromatogr., 1999, 22, 6, 343-349, https://doi.org/10.1002/(SICI)1521-4168(19990601)22:6<343::AID-JHRC343>3.0.CO;2-J . [all data]

Sumathykutty, Rao, et al., 1999
Sumathykutty, M.A.; Rao, J.M.; Padmakumari, K.P.; Narayanan, C.S., Essential oil constituents of some Piper species, Flavour Fragr. J., 1999, 14, 5, 279-282, https://doi.org/10.1002/(SICI)1099-1026(199909/10)14:5<279::AID-FFJ821>3.0.CO;2-0 . [all data]

Valero, Sanz, et al., 1999
Valero, E.; Sanz, J.; Martinez-Castro, I., Volatile components in microwave- and conventionally-heated milk, Food Chem., 1999, 66, 3, 333-338, https://doi.org/10.1016/S0308-8146(99)00069-2 . [all data]

Weyerstahl, Marschall, et al., 1999
Weyerstahl, P.; Marschall, H.; Wahlburg, H.-C.; Christiansen, C.; Rustaiyan, A.; Mirdjalili, F., Constituents of the essential oil of Pulicaria gnaphalodes (Vent.) Boiss. from Iran, Flavour Fragr. J., 1999, 14, 2, 121-130, https://doi.org/10.1002/(SICI)1099-1026(199903/04)14:2<121::AID-FFJ790>3.0.CO;2-K . [all data]

Bicchi, Rubiolo, et al., 1998
Bicchi, C.; Rubiolo, P.; Marschall, H.; Weyerstahl, P.; Laurent, R., Constituents of Artemisia roxburghiana Besser essential oil, Flavour Fragr. J., 1998, 13, 1, 40-46, https://doi.org/10.1002/(SICI)1099-1026(199801/02)13:1<40::AID-FFJ688>3.0.CO;2-Z . [all data]

Isidorov, Zenkevich, et al., 1998
Isidorov, V.A.; Zenkevich, I.G.; Dubis, E.N.; Slowikowski, A.; Wojciuk, E., Group identification of essential oils components using partition coefficients in a hexane-acetonitrile system, J. Chromatogr. A, 1998, 814, 1-2, 253-260, https://doi.org/10.1016/S0021-9673(98)00398-7 . [all data]

Oprean, Tamas, et al., 1998
Oprean, R.; Tamas, M.; Sandulescu, R.; Roman, L., Essential oils analysis. I. Evaluation of essential oils composition using both GC and MS fingerprints, J. Pharm. Biomed. Anal., 1998, 18, 4-5, 651-657, https://doi.org/10.1016/S0731-7085(98)00283-0 . [all data]

Analytical Methods Committee, 1997
Analytical Methods Committee, The Royal Society of Chemistry, Application of gas-liquid chromatography to the analysis of essential oils. Part XVII. Fingerprinting of essential oils by temperature-programmed gas-liquid chromatography using capillary columns with non-polar stationary phases, Analyst, 1997, 122, 10, 1167-1174, https://doi.org/10.1039/a704651k . [all data]

Mariotti, Tomi, et al., 1997
Mariotti, J.P.; Tomi, F.; Casanova, J.; Costa, J.; Bernardini, A.F., Composition of the essential oil of Cistus Iadaniferus L. cultivated in corsica (France), Flavour Fragr. J., 1997, 12, 3, 147-151, https://doi.org/10.1002/(SICI)1099-1026(199705)12:3<147::AID-FFJ631>3.0.CO;2-Q . [all data]

Vahirua-Lechat, Menut, et al., 1996
Vahirua-Lechat, I.; Menut, C.; Roig, B.; Bessiere, J.M.; Lamaty, G., Isoprene related esters, significant components of Pandanus tectorius, Phytochemistry, 1996, 43, 6, 1277-1279, https://doi.org/10.1016/S0031-9422(96)00386-X . [all data]

Chanegriha and Baaliouamer, 1993
Chanegriha, N.; Baaliouamer, A., Evaluation of series-coupled gas chromatographic capillaries of different polarities. Application to the resolution of problem pairs of constituents in Algerian cypress essential oil, J. Chromatogr., 1993, 633, 1-2, 163-168, https://doi.org/10.1016/0021-9673(93)83150-Q . [all data]

Gómez, Ledbetter, et al., 1993
Gómez, E.; Ledbetter, C.A.; Hartsell, P.L., Volatile compounds in apricot, plum, and their interspecific hybrids, J. Agric. Food Chem., 1993, 41, 10, 1669-1676, https://doi.org/10.1021/jf00034a029 . [all data]

Yang, Sugisawa, et al., 1992
Yang, R.; Sugisawa, H.; Nakatani, H.; Tamura, H.; Takagi, N., Comparison of odor quality in peel oils of acid citrus, Nippon Shokuhin Kogyo Gakkaishi, 1992, 39, 1, 16-24, https://doi.org/10.3136/nskkk1962.39.16 . [all data]

Le Quere and Latrasse, 1990
Le Quere, J.-L.; Latrasse, A., Composition of the Essential Oils of Blackcurrant Buds (Ribes nigrum L.), J. Agric. Food Chem., 1990, 38, 1, 3-10, https://doi.org/10.1021/jf00091a001 . [all data]

De Pooter, Omar, et al., 1985
De Pooter, H.L.; Omar, M.N.; Coolsaet, B.A.; Schamp, N.M., The Essential Oil of Greater Galanga (Alpinia Galanga) from Malaysia, Phytochemistry, 1985, 24, 1, 93-96, https://doi.org/10.1016/S0031-9422(00)80814-6 . [all data]