Ethanol, 2-(vinyloxy)-

Phase change data

Data compiled by: Thermodynamics Research Center, NIST Boulder Laboratories, Chris Muzny director

Quantity Value Units Method Reference Comment
Tboil413.KN/ARofman, Yakubov, et al., 1976Uncertainty assigned by TRC = 3. K

In addition to the Thermodynamics Research Center (TRC) data available from this site, much more physical and chemical property data is available from the following TRC products:

Gas phase ion energetics data

Data compiled by: John E. Bartmess

De-protonation reactions

C4H7O2- + Hydrogen cation = Ethanol, 2-(vinyloxy)-

By formula: C4H7O2- + H+ = C4H8O2

Quantity Value Units Method Reference Comment
Δr369.7 ± 2.9kcal/molG+TSGraul, Schnute, et al., 1990gas phase
Quantity Value Units Method Reference Comment
Δr363.1 ± 2.8kcal/molCIDCGraul, Schnute, et al., 1990gas phase

References

Rofman, Yakubov, et al., 1976
Rofman, V.M.; Yakubov, R.D.; Trofimov, B.A.; Maksimov, S.M., Liq-vap. equil. in system formed by products of vinylation of triethylene glycol & product of epoxidation of ethylene glycol monovinyl ether witrh epichlorohydrin, Zh. Prikl. Khim. (Leningrad), 1976, 49, 1159-61. [all data]