(Z)-1,2-Dimethylthioethene

Reaction thermochemistry data

Data compiled by: Hussein Y. Afeefy, Joel F. Liebman, and Stephen E. Stein

Individual Reactions

(Z)-1,2-Dimethylthioethene = (E)-Ethylene, 1,2-bis(methylthio)-

By formula: C4H8S2 = C4H8S2

Quantity Value Units Method Reference Comment
Δr3.89 ± 0.95kJ/molEqkSchroth, Schaedler, et al., 1985liquid phase

References

Schroth, Schaedler, et al., 1985
Schroth, W.; Schaedler, H.D.; Kemmler, R., (Z, E) Isomerism of 1,2-bis(organothio)ethenes, Z. Chem., 1985, 25, 170-171. [all data]