Plumbane, 1,4-phenylenebis[trimethyl-]-

Gas phase ion energetics data

Data compiled by: Sharon G. Lias, Rhoda D. Levin, and Sherif A. Kafafi

Ionization energy determinations

IE (eV) Method Reference Comment
8.25PEKaim, Tesmann, et al., 1980Vertical value

References

Kaim, Tesmann, et al., 1980
Kaim, W.; Tesmann, H.; Bock, H., Me3C-, Me3Si-, Me3Ge-, Me3Sn- und Me3Pb-substituierte benzol- und naphthalin-derivate und ihre radikalanionen, Chem. Ber., 1980, 113, 3221. [all data]