cyclodecanol, 1-methyl-

Phase change data

Data compiled by: Thermodynamics Research Center, NIST Boulder Laboratories, Chris Muzny director

Quantity Value Units Method Reference Comment
Tfus309.9KN/ABrown and Borkowski, 1952Uncertainty assigned by TRC = 3. K

In addition to the Thermodynamics Research Center (TRC) data available from this site, much more physical and chemical property data is available from the following TRC products:

References

Brown and Borkowski, 1952
Brown, H.C.; Borkowski, M., 1-Chloro-1-methylcycloalkanes, J. Am. Chem. Soc., 1952, 74, 1894. [all data]