HCONH2+

Vibrational and/or electronic energy levels

Data compiled by: Marilyn E. Jacox

State:   E

 Energy
 (cm-1
 Med.   Transition   λmin
 (nm)
 λmax
 (nm)

References

Tx = 71600 T gas Brundle, Turner, et al., 1969

State:   D

 Energy
 (cm-1
 Med.   Transition   λmin
 (nm)
 λmax
 (nm)

To = 48650 ± 320 gas Brundle, Turner, et al., 1969

Vib.
sym.
 No.   Approximate
 type of mode
 cm-1   Med.   Method   References

a' 1100 ± 30 gas PE Brundle, Turner, et al., 1969

State:   C

 Energy
 (cm-1
 Med.   Transition   λmin
 (nm)
 λmax
 (nm)

To = 36230 ± 320 gas Brundle, Turner, et al., 1969

Vib.
sym.
 No.   Approximate
 type of mode
 cm-1   Med.   Method   References

a' 1050 ± 30 gas PE Brundle, Turner, et al., 1969

State:   B

 Energy
 (cm-1
 Med.   Transition   λmin
 (nm)
 λmax
 (nm)

To = 29290 ± 320 gas Brundle, Turner, et al., 1969

Vib.
sym.
 No.   Approximate
 type of mode
 cm-1   Med.   Method   References

a' 1090 ± 30 gas PE Brundle, Turner, et al., 1969

State:   A

 Energy
 (cm-1
 Med.   Transition   λmin
 (nm)
 λmax
 (nm)

Tx = 3150 ± 320 gas Brundle, Turner, et al., 1969

Vib.
sym.
 No.   Approximate
 type of mode
 cm-1   Med.   Method   References

a' 640 ± 30 gas PE Brundle, Turner, et al., 1969

State:   X

Vib.
sym.
 No.   Approximate
 type of mode
 cm-1   Med.   Method   References

a' CO stretch 1600 ± 30 gas PE Brundle, Turner, et al., 1969

Additional references: Jacox, 1994, page 318

Brundle, Turner, et al., 1969
Brundle, C.R.; Turner, D.W.; Robin, M.B.; Basch, H., Photoelectron spectroscopy of simple amides and carboxylic acids, Chem. Phys. Lett., 1969, 3, 292. [all data]

Jacox, 1994
Jacox, M.E., Vibrational and electronic energy levels of polyatomic transient molecules, American Chemical Society, Washington, DC, 1994, 464. [all data]