n-Heptylmalonic acid

Condensed phase thermochemistry data

Data compiled by: Hussein Y. Afeefy, Joel F. Liebman, and Stephen E. Stein

Quantity Value Units Method Reference Comment
Δcsolid-5431.2 ± 7.1kJ/molCcbVerkade and Coops, 1933At 288 °K; Corresponding Δfsolid = -1076.4 kJ/mol (simple calculation by NIST; no Washburn corrections)

References

Verkade and Coops, 1933
Verkade, P.E.; Coops, J., Jr., Alternation phenomena VI (calorimetric researches XX): alternations in the properties of n.monoalkylmalonic acids. Some remarks on malkins views concerning the alternation phenonema, Recl. Trav. Chim. Pays-Bas, 1933, 52, 747-767. [all data]