2,7-Octadiene-1,6-diol, 2,6-dimethyl-, (E)-

Normal alkane RI, polar column, custom temperature program

Data compiled by: NIST Mass Spectrometry Data Center, William E. Wallace, director

Column type CapillaryCapillaryCapillaryCapillary
Active phase DB-WaxCP-Wax 52CBCP-Wax 52 CBDB-Wax
Column length (m) 30.25.30.30.
Carrier gas HeH2H2
Substrate
Column diameter (mm) 0.250.30.320.25
Phase thickness (μm) 0.51.2 0.25
Program 30C => 70C/min => 60C (3min) => 3C/min => 245C (20min)60C(3min) => 2C/min => 220C => 3C/min => 245C60 0C 2 0C/min -> 220 0C 3 0C/min -> 245 0Cnot specified
I 2275.2298.2266.2296.
ReferenceSchneider, Razungles, et al., 2001López-Tamames, Carro-Mariño, et al., 1997Carro Marino, López Tamames, et al., 1995Marlatt, Ho, et al., 1992
Comment MSDC-RI MSDC-RI MSDC-RI MSDC-RI

Normal alkane RI, polar column, temperature ramp

Data compiled by: NIST Mass Spectrometry Data Center, William E. Wallace, director

Column type CapillaryCapillary
Active phase DB-WaxDB-Wax
Column length (m) 25.25.
Carrier gas HeHe
Substrate
Column diameter (mm) 0.250.25
Phase thickness (μm) 0.250.25
Tstart (C) 50.50.
Tend (C) 200.200.
Heat rate (K/min) 4.4.
Initial hold (min) 4.4.
Final hold (min) 10.10.
I 2294.2318.
ReferenceMorales, Duque, et al., 2000Morales, Duque, et al., 2000
Comment MSDC-RI MSDC-RI

Van Den Dool and Kratz RI, non-polar column, temperature ramp

Data compiled by: NIST Mass Spectrometry Data Center, William E. Wallace, director

Column type Capillary
Active phase DB-5MS
Column length (m) 30.
Carrier gas H2
Substrate
Column diameter (mm) 0.25
Phase thickness (μm) 0.25
Tstart (C) 40.
Tend (C) 200.
Heat rate (K/min) 2.
Initial hold (min)
Final hold (min)
I 1333.
ReferenceChassagne, Boulanger, et al., 1999
Comment MSDC-RI

References

Schneider, Razungles, et al., 2001
Schneider, R.; Razungles, A.; Augier, C.; Baumes, R., Monoterpenic and norisoprenoidic glycoconjugates of Vitis vinifera L. cv. Melon B. as precursors of odorants in Muscadet wines, J. Chromatogr. A, 2001, 936, 1-2, 145-157, https://doi.org/10.1016/S0021-9673(01)01150-5 . [all data]

López-Tamames, Carro-Mariño, et al., 1997
López-Tamames, E.; Carro-Mariño, N.; Gunata, Y.Z.; Sapis, C.; Baumes, R.; Bayonove, C., Potential aroma in several varieties of Spanish grapes, J. Agric. Food Chem., 1997, 45, 5, 1729-1735, https://doi.org/10.1021/jf960572w . [all data]

Carro Marino, López Tamames, et al., 1995
Carro Marino, N.; López Tamames, E.; García Jares, C.M., Contribution to the study of the aromatic potential of three muscat Vitis vinifera varieties: identification of new compounds, Food Sci. Technol. Int., 1995, 1, 2-3, 105-116, https://doi.org/10.1177/108201329500100206 . [all data]

Marlatt, Ho, et al., 1992
Marlatt, C.; Ho, C.-T.; Chien, M., Studies of aroma constituents bound as glycosides in tomato, J. Agric. Food Chem., 1992, 40, 2, 249-252, https://doi.org/10.1021/jf00014a016 . [all data]