Propanoic acid, 2,2-dimethyl-

Condensed phase thermochemistry data

Data compiled as indicated in comments:
ALS - Hussein Y. Afeefy, Joel F. Liebman, and Stephen E. Stein
DH - Eugene S. Domalski and Elizabeth D. Hearing

Quantity Value Units Method Reference Comment
Δfsolid-564.5 ± 5.9kJ/molCcbHancock, Watson, et al., 1954Reanalyzed by Cox and Pilcher, 1970, Original value = -565. kJ/mol; ALS
Quantity Value Units Method Reference Comment
Δcsolid-2832.1 ± 5.9kJ/molCcbHancock, Watson, et al., 1954Reanalyzed by Cox and Pilcher, 1970, Original value = -2830. kJ/mol; Corresponding Δfsolid = -564.55 kJ/mol (simple calculation by NIST; no Washburn corrections); ALS

Constant pressure heat capacity of solid

Cp,solid (J/mol*K) Temperature (K) Reference Comment
192.2298.15Singh and Glicksman, 1990T = 295 to 319 K. Cp(c) = 13.38 + 0.1092T cal/mol*K (295 to 300 K). Cp value calculated from equation. Cp(liq) = 16.19 + 0.1042T cal/mol*K.; DH
178.298.15Konicek and Wadso, 1971DH

Ion clustering data

Data compiled as indicated in comments:
B - John E. Bartmess
M - Michael M. Meot-Ner (Mautner) and Sharon G. Lias

Clustering reactions

Iodide + Propanoic acid, 2,2-dimethyl- = (Iodide • Propanoic acid, 2,2-dimethyl-)

By formula: I- + C5H10O2 = (I- • C5H10O2)

Quantity Value Units Method Reference Comment
Δr64.4 ± 4.2kJ/molTDAsCaldwell and Kebarle, 1984gas phase; B,M
Quantity Value Units Method Reference Comment
Δr90.8J/mol*KPHPMSCaldwell and Kebarle, 1984gas phase; M
Quantity Value Units Method Reference Comment
Δr37. ± 4.2kJ/molTDAsCaldwell and Kebarle, 1984gas phase; B

Henry's Law data

Data compiled by: Rolf Sander

Henry's Law constant (water solution)

kH(T) = H exp(d(ln(kH))/d(1/T) ((1/T) - 1/(298.15 K)))
H = Henry's law constant for solubility in water at 298.15 K (mol/(kg*bar))
d(ln(kH))/d(1/T) = Temperature dependence constant (K)

H (mol/(kg*bar)) d(ln(kH))/d(1/T) (K) Method Reference
350. MN/A

References

Hancock, Watson, et al., 1954
Hancock, C.K.; Watson, G.M.; Gilby, R.F., Heats of combustion of five-carbon fatty acids and their methyl and ethyl esters, J. Phys. Chem., 1954, 58, 127-129. [all data]

Cox and Pilcher, 1970
Cox, J.D.; Pilcher, G., Thermochemistry of Organic and Organometallic Compounds, Academic Press, New York, 1970, 1-636. [all data]

Singh and Glicksman, 1990
Singh, N.B.; Glicksman, M.E., Physical properties of ultra-pure pivalic acid, Thermochim. Acta, 1990, 159, 93-99. [all data]

Konicek and Wadso, 1971
Konicek, J.; Wadso, I., Thermochemical properties of some carboxylic acids, amines and N-substituted amides in aqueous solution, Acta Chem. Scand., 1971, 25, 1541-1551. [all data]