Propanamide, N,N-dimethyl-

Condensed phase thermochemistry data

Data compiled as indicated in comments:
ALS - Hussein Y. Afeefy, Joel F. Liebman, and Stephen E. Stein
DH - Eugene S. Domalski and Elizabeth D. Hearing

Quantity Value Units Method Reference Comment
Δcliquid-3236.6 ± 0.92kJ/molCcbVasil'eva and Kotov, 1977ALS

Constant pressure heat capacity of liquid

Cp,liquid (J/mol*K) Temperature (K) Reference Comment
209.298.15Konicek and Wadso, 1971DH

Gas phase thermochemistry data

Data compiled by: Hussein Y. Afeefy, Joel F. Liebman, and Stephen E. Stein

Quantity Value Units Method Reference Comment
Δfgas-250.2kJ/molCcbVasil'eva and Kotov, 1977

References

Vasil'eva and Kotov, 1977
Vasil'eva, T.F.; Kotov, V.I., Heats of combustion of dimethyl-substituted amides and dimethylalkylamines, Vses. Konf. Kalorim. Rasshir. Tezisy Dokl. 7th, 1977, 1, 102-106. [all data]

Konicek and Wadso, 1971
Konicek, J.; Wadso, I., Thermochemical properties of some carboxylic acids, amines and N-substituted amides in aqueous solution, Acta Chem. Scand., 1971, 25, 1541-1551. [all data]