12-methyltridecanal

Normal alkane RI, non-polar column, custom temperature program

View large format table.

Column type Active phase I Reference Comment
CapillarySE-541576.Guth and Grosch, 1994Program: 0C (2min) => 6C/min => 50C (2min) => 6C/min => 230 C (10min)

Normal alkane RI, polar column, temperature ramp

View large format table.

Column type Active phase I Reference Comment
CapillarySupelcowax-101883.Rochat and Chaintreau, 200560. m/0.53 mm/1. μm, He, 40. C @ 2. min, 4. K/min, 240. C @ 20. min
CapillarySupelcowax-101884.Rochat and Chaintreau, 200560. m/0.53 mm/1. μm, He, 40. C @ 2. min, 4. K/min, 240. C @ 20. min
CapillarySupelcowax-101889.Rochat and Chaintreau, 200560. m/0.53 mm/1. μm, He, 40. C @ 2. min, 4. K/min, 240. C @ 20. min
CapillaryHP-FFAP1871.Preininger and Ullrich, 200150. m/0.32 mm/0.5 μm, 6. K/min, 230. C @ 15. min; Tstart: 35. C

Normal alkane RI, polar column, custom temperature program

View large format table.

Column type Active phase I Reference Comment
CapillaryFFAP1863.Guth and Grosch, 1994Program: not specified

References

Guth and Grosch, 1994
Guth, H.; Grosch, W., Identification of the character impact odorants of stewed beef juice by instrumental analyses and sensory studies, J. Agric. Food Chem., 1994, 42, 12, 2862-2866, https://doi.org/10.1021/jf00048a039 . [all data]

Rochat and Chaintreau, 2005
Rochat, S.; Chaintreau, A., Carbonyl Odorants Contributing to the In-Oven Roast Beef Top Note, J. Agric. Food Chem., 2005, 53, 24, 9578-9585, https://doi.org/10.1021/jf058089l . [all data]

Preininger and Ullrich, 2001
Preininger, M.; Ullrich, F., Trace compound analysis for off-flavor characterization of micromilled milk powder, Am. Chem. Soc. Symp. Ser., 2001, 782, 46-61. [all data]