Ytterbium, bis(η5-pentamethylcyclopentadienyl-

Gas phase ion energetics data

Data compiled by: Sharon G. Lias, John E. Bartmess, Joel F. Liebman, John L. Holmes, Rhoda D. Levin, and W. Gary Mallard

Ionization energy determinations

IE (eV) Method Reference Comment
6.11PEGreen, Hohl, et al., 1987Vertical value

References

Green, Hohl, et al., 1987
Green, J.C.; Hohl, D.; Rosch, N., (Cyclopentadienyl)lanthanide compounds Ln(C5Me5)2 (Ln = Sm, Eu, Yb): Photoelectron spectra and molecular orbital calculations, Organometallics, 1987, 6, 712. [all data]