Disilver dichloride

Gas phase ion energetics data

Data compiled by: Sharon G. Lias, Rhoda D. Levin, and Sherif A. Kafafi

Ionization energy determinations

IE (eV) Method Reference
10.3 ± 0.5EIWagner and Grimley, 1972

References

Wagner and Grimley, 1972
Wagner, L.C.; Grimley, R.T., A study of ionization processes by the angular distribution technique. The AgCl system, J. Phys. Chem., 1972, 76, 2819. [all data]