Tricyclo[3.3.1.1(3,7)]decane, 1-nitro-

Kovats' RI, non-polar column, isothermal

View large format table.

Column type Active phase Temperature (C) I Reference Comment
PackedPMS-1000160.1500.Kurbatova, Moiseev, et al., 1999N2, Chromatron N-AW; Column length: 1. m

References

Kurbatova, Moiseev, et al., 1999
Kurbatova, S.V.; Moiseev, I.K.; Kudryashov, S.Yu.; Yashkin, S.N.; Postnikova, I.V., Chromatographic examination of the intermediate products of midantane synthesis, J. Anal. Chem. USSR (Engl. Transl.), 1999, 54, 1, 75-77. [all data]