1,7-Dicarbadodecaborane(12), 1-hexyl-

Gas phase ion energetics data

Data compiled by: Sharon G. Lias and Joel F. Liebman

Ionization energy determinations

IE (eV) Method Reference
9.39PIOrlov, Pustobaev, et al., 1989

References

Orlov, Pustobaev, et al., 1989
Orlov, W.M.; Pustobaev, V.N.; Poroshina, T.Yu.; O'shevskaya, V.A.; Zakharkin, L.I.; Gal'chenko, G.L., Ionization energies of C-monoalkyl substituted ortho- and metacarboranes-12, Dokl. Phys. Chem., 1989, 309, 968, In original 892. [all data]