1,2-Dicarbadodecaborane(12), 1-pentyl-

Phase change data

Data compiled by: William E. Acree, Jr., James S. Chickos

Quantity Value Units Method Reference Comment
Δvap84.3 ± 6.0kJ/molEBShul'tse, Varushchenko, et al., 1980Based on data from 446. - 549. K.

Enthalpy of vaporization

ΔvapH (kJ/mol) Temperature (K) Method Reference Comment
52.0 ± 1.5571.EBShul'tse, Varushchenko, et al., 1980Based on data from 446. - 549. K.

References

Shul'tse, Varushchenko, et al., 1980
Shul'tse, P.; Varushchenko, R.M.; Gal'chenko, G.L.; Klimova, T.V.; Stanko, V.I., Russ. J. Gen. Chem., 1980, 50, 1482. [all data]