HCCl radical anion

Gas phase thermochemistry data

Data compiled by: John E. Bartmess

Quantity Value Units Method Reference Comment
Δfgas50.1 ± 2.0kcal/molR-EAGilles, Ervin, et al., 1992Triplet state is 4.2±2.5 kcal/mol higher in energy than neutral singlet

Vibrational and/or electronic energy levels

Data compiled by: Marilyn E. Jacox

State:   ?

 Energy
 (cm-1
 Med.   Transition   λmin
 (nm)
 λmax
 (nm)

References

Td = 9760 ± 40 gas Murray, Leopold, et al., 1988
Gilles, Ervin, et al., 1992

State:   X

Vib.
sym.
 No.   Approximate
 type of mode
 cm-1   Med.   Method   References

a' 3 CCl stretch 445 ± 25 gas PE Murray, Leopold, et al., 1988
Gilles, Ervin, et al., 1992

Additional references: Jacox, 1994, page 47

Gilles, Ervin, et al., 1992
Gilles, M.K.; Ervin, K.M.; Ho, J.; Lineberger, W.C., Negative Ion Photoelectron Spectroscopy of HCF-, HCCl-, HCBr-, and HCI- - Photoelectron Angular Distributions and Neutral Triplet Excitation, J. Phys. Chem., 1992, 96, 3, 1130, https://doi.org/10.1021/j100182a021 . [all data]

Murray, Leopold, et al., 1988
Murray, K.K.; Leopold, D.G.; Miller, T.M.; Lineberger, W.C., Photoelectron Spectroscopy of the Halocarbene Anions HCF-, HCCl-, HCBr-, HCI-, CF2-, and CCl2-, J. Chem. Phys., 1988, 89, 9, 5442, https://doi.org/10.1063/1.455596 . [all data]

Jacox, 1994
Jacox, M.E., Vibrational and electronic energy levels of polyatomic transient molecules, American Chemical Society, Washington, DC, 1994, 464. [all data]