L-Threonine, 2TMS derivative

Van Den Dool and Kratz RI, non-polar column, custom temperature program

View large format table.

Column type Active phase I Reference Comment
CapillaryVF-5MS1285.Tret'yakov, 200730. m/0.25 mm/0.25 μm, He; Program: Multi-step temperature program; T(initial)=60C; T(final)=270C

Normal alkane RI, non-polar column, temperature ramp

View large format table.

Column type Active phase I Reference Comment
CapillaryHP-51299.Isidorov, Lech, et al., 200830. m/0.25 mm/0.25 μm, Helium, 3. K/min, 300. C @ 30. min; Tstart: 50. C

References

Tret'yakov, 2007
Tret'yakov, K.V., Retention Data. NIST Mass Spectrometry Data Center., NIST Mass Spectrometry Data Center, 2007. [all data]

Isidorov, Lech, et al., 2008
Isidorov, V.A.; Lech, P.; Zolciak, A.; Rusak, N.; Szczepaniak, L., Gas Chromatographic - nass spectrometric investigation of metabolites from the needles and roots of pine seedlings at early stages of pathogenic fungi Armillaria ostoyae attack, Trees, 2008, 22, 4, 531-542, https://doi.org/10.1007/s00468-008-0213-z . [all data]