Lovastatin

Phase change data

Data compiled by: William E. Acree, Jr., James S. Chickos

Enthalpy of fusion

ΔfusH (kJ/mol) Temperature (K) Method Reference
43.14445.5DSCNti-Gyabaah, Chmielowski, et al., 2008
36.53444.3DSCTung, Tabora, et al., 2008

References

Nti-Gyabaah, Chmielowski, et al., 2008
Nti-Gyabaah, J.; Chmielowski, R.; Chan, V.; Chiew, Y.C., Solubility of lovastatin in a family of six alcohols: Ethanol, 1-propanol, 1-butanol, 1-pentanol, 1-hexanol, and 1-octanol, International Journal of Pharmaceutics, 2008, 359, 1-2, 111-117, https://doi.org/10.1016/j.ijpharm.2008.03.046 . [all data]

Tung, Tabora, et al., 2008
Tung, Hsien-Hsin; Tabora, Jose; Variankaval, Nara; Bakken, Daniel; Chen, Chau-Chyun, Prediction of pharmaceutical solubilityVia NRTL-SAC and COSMO-SAC, J. Pharm. Sci., 2008, 97, 5, 1813-1820, https://doi.org/10.1002/jps.21032 . [all data]