dichlorodivinylstannane

Reaction thermochemistry data

Data compiled by: José A. Martinho Simões

Individual Reactions

Stannane, tetraethenyl- (l) + Tin(IV) chloride (l) = 2C4H6Cl2Sn (l)

By formula: C8H12Sn (l) + Cl4Sn (l) = 2C4H6Cl2Sn (l)

Quantity Value Units Method Reference Comment
Δr-22.0 ± 3.0kcal/molRSCNash, Skinner, et al., 1965

References

Nash, Skinner, et al., 1965
Nash, G.A.; Skinner, H.A.; Stack, W.F., Trans. Faraday Soc., 1965, 61, 640. [all data]