In10P10

Gas phase ion energetics data

Data compiled by: John E. Bartmess

Electron affinity determinations

EA (eV) Method Reference Comment
2.65 ± 0.15LPESAsmis, Taylor, et al., 1999Vertical Detachment Energy: 3.59±0.15 eV

References

Asmis, Taylor, et al., 1999
Asmis, K.R.; Taylor, T.R.; Neumark, D.M., Electronic structure of indium phosphide clusters: anion photoelectron spectroscopy of InxPx- and Inx+1Px- (x=1-13) clusters, Chem. Phys. Lett., 1999, 308, 5-6, 347-354, https://doi.org/10.1016/S0009-2614(99)00671-5 . [all data]