2-Propanone, ethyl(1-methylethyl)hydrazone

Condensed phase thermochemistry data

Data compiled by: Hussein Y. Afeefy, Joel F. Liebman, and Stephen E. Stein

Quantity Value Units Method Reference Comment
Δfliquid-12.7 ± 0.24kcal/molCcbLebedeva, Masalitinova, et al., 1980
Quantity Value Units Method Reference Comment
Δcliquid-1354.5 ± 0.24kcal/molCcbLebedeva, Masalitinova, et al., 1980

References

Lebedeva, Masalitinova, et al., 1980
Lebedeva, N.D.; Masalitinova, T.N.; Ryadnenko, V.L.; Monyakova, O.N., Enthalpies of combustion and formation of alkyl-substituted hydrazones, J. Appl. Chem. USSR, 1980, 53, 1800-1803. [all data]