Propane, 2-bromo-
- Formula: C3H7Br
- Molecular weight: 122.992
- IUPAC Standard InChIKey: NAMYKGVDVNBCFQ-UHFFFAOYSA-N
- CAS Registry Number: 75-26-3
- Chemical structure:

Gas phase thermochemistry data

Data compiled by: Hussein Y. Afeefy, Joel F. Liebman, and Stephen E. Stein
Quantity | Value | Units | Method | Reference | Comment |
---|---|---|---|---|---|
ΔfH°gas | -95.6 ± 1.0 | kJ/mol | Chyd | Davies, Lacher, et al., 1965 | Reanalyzed by Cox and Pilcher, 1970, Original value = -95.02 kJ/mol |
ΔfH°gas | -98.5 ± 1.9 | kJ/mol | Eqk | Rozhnov and Andreevskii, 1962 | |
ΔfH°gas | -98.5 ± 1.9 | kJ/mol | Ccr | Bjellerup, 1961 |

Condensed phase thermochemistry data

Data compiled as indicated in comments:
ALS - Hussein Y. Afeefy, Joel F. Liebman, and Stephen E. Stein
DH - Eugene S. Domalski and Elizabeth D. Hearing
Quantity | Value | Units | Method | Reference | Comment |
---|---|---|---|---|---|
ΔfH°liquid | -129. | kJ/mol | Cm | Holm, 1973 | Grignard Rx; ALS |
ΔfH°liquid | -129.1 ± 1.8 | kJ/mol | Ccr | Bjellerup, 1961 | ALS |
Quantity | Value | Units | Method | Reference | Comment |
ΔcH°liquid | -2051.9 ± 1.8 | kJ/mol | Ccr | Bjellerup, 1961 | ALS |
Constant pressure heat capacity of liquid
Cp,liquid (J/mol*K) | Temperature (K) | Reference | Comment |
---|---|---|---|
135.6 | 298.15 | Shehatta, 1993 | DH |
126.8 | 209.6 | Kushner, Crowe, et al., 1950 | T = 117 to 209 K. Value is unsmoothed experimental datum.; DH |
132.2 | 298. | von Reis, 1881 | T = 287 to 344 K.; DH |

Phase change data

Data compiled as indicated in comments:
BS - Robert L. Brown and Stephen E. Stein
TRC - Thermodynamics Research Center, NIST Boulder Laboratories, Chris Muzny director
AC - William E. Acree, Jr., James S. Chickos
ALS - Hussein Y. Afeefy, Joel F. Liebman, and Stephen E. Stein
DH - Eugene S. Domalski and Elizabeth D. Hearing
Quantity | Value | Units | Method | Reference | Comment |
---|---|---|---|---|---|
Tboil | 333. ± 1. | K | AVG | N/A | Average of 15 values; Individual data points |
Quantity | Value | Units | Method | Reference | Comment |
Tfus | 184.2 | K | N/A | Kushner, Crowe, et al., 1950, 2 | Uncertainty assigned by TRC = 0.3 K; TRC |
Tfus | 184.55 | K | N/A | Timmermans, 1921 | Uncertainty assigned by TRC = 0.5 K; TRC |
Tfus | 184.05 | K | N/A | Timmermans, 1921 | Uncertainty assigned by TRC = 0.5 K; TRC |
Quantity | Value | Units | Method | Reference | Comment |
Tc | 532. | K | N/A | Majer and Svoboda, 1985 | |
Quantity | Value | Units | Method | Reference | Comment |
ΔvapH° | 30.33 | kJ/mol | N/A | Majer and Svoboda, 1985 | |
ΔvapH° | 30.6 | kJ/mol | CGC | Chickos, Hosseini, et al., 1995 | Based on data from 323. to 363. K.; AC |
ΔvapH° | 30.2 ± 0.1 | kJ/mol | C | Wadsö, Murto, et al., 1966 | AC |
ΔvapH° | 30.2 ± 0.08 | kJ/mol | C | Wadso, 1966 | ALS |
Enthalpy of vaporization
ΔvapH (kJ/mol) | Temperature (K) | Method | Reference | Comment |
---|---|---|---|---|
28.33 | 332.6 | N/A | Majer and Svoboda, 1985 | |
32.1 | 251. | A | Stephenson and Malanowski, 1987 | Based on data from 236. to 328. K.; AC |
30.1 | 314. | EB | Stephenson and Malanowski, 1987 | Based on data from 299. to 332. K. See also Svoboda, Majer, et al., 1977.; AC |
29.8 ± 0.1 | 305. | C | Svoboda, Majer, et al., 1977 | AC |
29.2 ± 0.1 | 318. | C | Svoboda, Majer, et al., 1977 | AC |
28.5 ± 0.1 | 330. | C | Svoboda, Majer, et al., 1977 | AC |
28.0 ± 0.1 | 338. | C | Svoboda, Majer, et al., 1977 | AC |
33.4 | 226. | N/A | Stull, 1947 | Based on data from 211. to 333. K.; AC |
28.4 | 331.6 | V | Mathews and Fehlandt, 1931 | ALS |
30.9 | 288. | N/A | Rex, 1906 | Based on data from 273. to 303. K. See also Boublik, Fried, et al., 1984.; AC |
Enthalpy of vaporization
ΔvapH =
A exp(-βTr) (1 − Tr)β
ΔvapH =
Enthalpy of vaporization (at saturation pressure)
(kJ/mol)
Tr = reduced temperature (T / Tc)
View plot Requires a JavaScript / HTML 5 canvas capable browser.
Temperature (K) | A (kJ/mol) | β | Tc (K) | Reference | Comment |
---|---|---|---|---|---|
298. to 338. | 44.51 | 0.2812 | 532. | Majer and Svoboda, 1985 |
Antoine Equation Parameters
log10(P) = A − (B / (T + C))
P = vapor pressure (bar)
T = temperature (K)
View plot Requires a JavaScript / HTML 5 canvas capable browser.
Temperature (K) | A | B | C | Reference | Comment |
---|---|---|---|---|---|
211.4 to 333. | 4.12953 | 1223.475 | -36.642 | Stull, 1947 | Coefficents calculated by NIST from author's data. |
273. to 303. | 4.25526 | 1280.788 | -31.109 | Rex, 1906, 2 | Coefficents calculated by NIST from author's data. |
Enthalpy of fusion
ΔfusH (kJ/mol) | Temperature (K) | Reference | Comment |
---|---|---|---|
6.530 | 184.1 | Kushner, Crowe, et al., 1950 | DH |
6.55 | 184.1 | Domalski and Hearing, 1996 | AC |
Entropy of fusion
ΔfusS (J/mol*K) | Temperature (K) | Reference | Comment |
---|---|---|---|
35.5 | 184.1 | Kushner, Crowe, et al., 1950 | DH |

Reaction thermochemistry data

Data compiled as indicated in comments:
ALS - Hussein Y. Afeefy, Joel F. Liebman, and Stephen E. Stein
B - John E. Bartmess
M - Michael M. Meot-Ner (Mautner) and Sharon G. Lias
Individual Reactions
By formula: HBr + C3H6 = C3H7Br
Quantity | Value | Units | Method | Reference | Comment |
---|---|---|---|---|---|
ΔrH° | -85.48 | kJ/mol | Cm | Lacher, Kianpour, et al., 1957 | gas phase; ALS |
ΔrH° | -83.889 | kJ/mol | Cm | Lacher, Lea, et al., 1950 | gas phase; Heat of hydrobromination at 367°K; ALS |
ΔrH° | -84.10 ± 0.59 | kJ/mol | Cm | Lacher, Walden, et al., 1950 | gas phase; Reanalyzed by Cox and Pilcher, 1970, Original value = -84.4 ± 1.0 kJ/mol; Heat of hydrobromination; ALS |
By formula: Br- + C3H7Br = (Br- • C3H7Br)
Quantity | Value | Units | Method | Reference | Comment |
---|---|---|---|---|---|
ΔrH° | 59.4 ± 4.2 | kJ/mol | TDAs | Li, Ross, et al., 1996 | gas phase; B |
ΔrH° | 51.04 | kJ/mol | TDAs | Dougherty, 1974 | gas phase; B,M |
Quantity | Value | Units | Method | Reference | Comment |
ΔrS° | 83.3 | J/mol*K | HPMS | Dougherty, 1974 | gas phase; M |
Quantity | Value | Units | Method | Reference | Comment |
ΔrG° | 26.4 ± 0.84 | kJ/mol | TDAs | Li, Ross, et al., 1996 | gas phase; B |
ΔrG° | 26.4 | kJ/mol | TDAs | Dougherty, 1974 | gas phase; B |
By formula: C3H7Br = C3H7Br
Quantity | Value | Units | Method | Reference | Comment |
---|---|---|---|---|---|
ΔrH° | -12.0 ± 0.54 | kJ/mol | Eqk | Alenin, Rozhnov, et al., 1974 | liquid phase; Heat of isomerization; ALS |
ΔrH° | -12.1 ± 1.6 | kJ/mol | Ciso | Rozhnov and Andreevskii, 1964 | gas phase; At 480.8 K; ALS |
ΔrH° | -9.2 ± 2.5 | kJ/mol | Eqk | Mayo and Dolnick, 1944 | liquid phase; Heat of isomerization; ALS |
By formula: Cl- + C3H7Br = (Cl- • C3H7Br)
Quantity | Value | Units | Method | Reference | Comment |
---|---|---|---|---|---|
ΔrH° | 63.6 ± 4.2 | kJ/mol | TDAs | Li, Ross, et al., 1996 | gas phase; B |
Quantity | Value | Units | Method | Reference | Comment |
ΔrG° | 35.6 ± 0.84 | kJ/mol | TDAs | Li, Ross, et al., 1996 | gas phase; B |
By formula: H2 + C3H7Br = HBr + C3H8
Quantity | Value | Units | Method | Reference | Comment |
---|---|---|---|---|---|
ΔrH° | -45.40 ± 0.92 | kJ/mol | Chyd | Davies, Lacher, et al., 1965 | gas phase; Reanalyzed by Cox and Pilcher, 1970, Original value = -45.06 kJ/mol; ALS |
By formula: Li+ + C3H7Br = (Li+ • C3H7Br)
Quantity | Value | Units | Method | Reference | Comment |
---|---|---|---|---|---|
ΔrH° | 128. | kJ/mol | ICR | Staley and Beauchamp, 1975 | gas phase; switching reaction(Li+)H2O, from graph; Dzidic and Kebarle, 1970 extrapolated; M |
By formula: C3H7Br = HBr + C3H6
Quantity | Value | Units | Method | Reference | Comment |
---|---|---|---|---|---|
ΔrH° | 81. ± 2. | kJ/mol | Eqk | Rozhnov and Andreevskii, 1962 | gas phase; ALS |

Gas phase ion energetics data

Data evaluated as indicated in comments:
L - Sharon G. Lias
Data compiled as indicated in comments:
LL - Sharon G. Lias and Joel F. Liebman
LLK - Sharon G. Lias, Rhoda D. Levin, and Sherif A. Kafafi
RDSH - Henry M. Rosenstock, Keith Draxl, Bruce W. Steiner, and John T. Herron
LBLHLM - Sharon G. Lias, John E. Bartmess, Joel F. Liebman, John L. Holmes, Rhoda D. Levin, and W. Gary Mallard
Quantity | Value | Units | Method | Reference | Comment |
---|---|---|---|---|---|
IE (evaluated) | 10.10 ± 0.02 | eV | N/A | N/A | L |
Ionization energy determinations
IE (eV) | Method | Reference | Comment |
---|---|---|---|
10.13 | EST | Luo and Pacey, 1992 | LL |
10.12 | PE | Kimura, Katsumata, et al., 1981 | LLK |
10.07 | PI | Traeger, 1980 | LLK |
10.4 ± 0.1 | EI | Gross, 1972 | LLK |
10.12 ± 0.015 | PE | Hashmall and Heilbronner, 1970 | RDSH |
10.08 ± 0.01 | PI | Watanabe, Nakayama, et al., 1962 | RDSH |
Appearance energy determinations
Ion | AE (eV) | Other Products | Method | Reference | Comment |
---|---|---|---|---|---|
C3H5+ | 11.98 | H2+Br | PI | Traeger, 1980 | LLK |
C3H5+ | 12.23 ± 0.06 | H2+Br | EI | Holmes and Osborne, 1978 | LLK |
C3H7+ | 10.42 ± 0.01 | Br | PIPECO | Rosenstock, Buff, et al., 1982 | LBLHLM |
C3H7+ | 10.33 | Br | PI | Traeger, 1980 | LLK |
C3H7+ | 10.7 ± 0.1 | Br | EI | Gross, 1972 | LLK |

Ion clustering data

Data compiled as indicated in comments:
B - John E. Bartmess
M - Michael M. Meot-Ner (Mautner) and Sharon G. Lias
Clustering reactions
By formula: Br- + C3H7Br = (Br- • C3H7Br)
Quantity | Value | Units | Method | Reference | Comment |
---|---|---|---|---|---|
ΔrH° | 59.4 ± 4.2 | kJ/mol | TDAs | Li, Ross, et al., 1996 | gas phase; B |
ΔrH° | 51.04 | kJ/mol | TDAs | Dougherty, 1974 | gas phase; B,M |
Quantity | Value | Units | Method | Reference | Comment |
ΔrS° | 83.3 | J/mol*K | HPMS | Dougherty, 1974 | gas phase; M |
Quantity | Value | Units | Method | Reference | Comment |
ΔrG° | 26.4 ± 0.84 | kJ/mol | TDAs | Li, Ross, et al., 1996 | gas phase; B |
ΔrG° | 26.4 | kJ/mol | TDAs | Dougherty, 1974 | gas phase; B |
By formula: Cl- + C3H7Br = (Cl- • C3H7Br)
Quantity | Value | Units | Method | Reference | Comment |
---|---|---|---|---|---|
ΔrH° | 63.6 ± 4.2 | kJ/mol | TDAs | Li, Ross, et al., 1996 | gas phase; B |
Quantity | Value | Units | Method | Reference | Comment |
ΔrG° | 35.6 ± 0.84 | kJ/mol | TDAs | Li, Ross, et al., 1996 | gas phase; B |
By formula: Li+ + C3H7Br = (Li+ • C3H7Br)
Quantity | Value | Units | Method | Reference | Comment |
---|---|---|---|---|---|
ΔrH° | 128. | kJ/mol | ICR | Staley and Beauchamp, 1975 | gas phase; switching reaction(Li+)H2O, from graph; Dzidic and Kebarle, 1970 extrapolated; M |

Kovats' RI, non-polar column, isothermal

Column type | Active phase | Temperature (C) | I | Reference | Comment |
---|---|---|---|---|---|
Packed | Squalane | 27. | 554. | Hively and Hinton, 1968 | He, Chromosorb P; Column length: 15. m; Column diameter: 0.25 mm |
Packed | Squalane | 49. | 558. | Hively and Hinton, 1968 | He, Chromosorb P; Column length: 15. m; Column diameter: 0.25 mm |
Packed | Squalane | 67. | 562. | Hively and Hinton, 1968 | He, Chromosorb P; Column length: 15. m; Column diameter: 0.25 mm |
Packed | Squalane | 86. | 565. | Hively and Hinton, 1968 | He, Chromosorb P; Column length: 15. m; Column diameter: 0.25 mm |
Packed | Apiezon L | 130. | 582. | von Kováts, 1958 | Celite (40:60 Gewichtsverhaltnis) |
Packed | Apiezon L | 70. | 583. | von Kováts, 1958 | Celite (40:60 Gewichtsverhaltnis) |

Normal alkane RI, non-polar column, isothermal

Column type | Active phase | Temperature (C) | I | Reference | Comment |
---|---|---|---|---|---|
Capillary | Apiezon L | 130. | 591. | Arruda, Junkes, et al., 2008 |

Normal alkane RI, non-polar column, custom temperature program

Column type | Active phase | I | Reference | Comment |
---|---|---|---|---|
Capillary | Polydimethyl siloxanes | 571. | Zenkevich, 2001 | Program: not specified |
Capillary | OV-1, SE-30, Methyl silicone, SP-2100, OV-101, DB-1, etc. | 565. | Waggott and Davies, 1984 | Hydrogen; Column length: 50. m; Column diameter: 0.32 mm; Program: not specified |

Henry's Law data

Data compiled by: Rolf Sander
Henry's Law constant (water solution)
kH(T) = k°H exp(d(ln(kH))/d(1/T) ((1/T) - 1/(298.15 K)))
k°H = Henry's law constant for solubility in water at 298.15 K (mol/(kg*bar))
d(ln(kH))/d(1/T) = Temperature dependence constant (K)
k°H (mol/(kg*bar)) | d(ln(kH))/d(1/T) (K) | Method | Reference | Comment |
---|---|---|---|---|
0.10 | Q | N/A | missing citation give several references for the Henry's law constants but don't assign them to specific species. Value at T = 293. K. | |
0.092 | V | N/A |

References

Davies, Lacher, et al., 1965
Davies, J.; Lacher, J.R.; Park, J.D.,
Reaction heats of organic compounds. Part 4.-Heats of hydrogenation of n- and iso-Propyl bromides and chlorides,
Trans. Faraday Soc., 1965, 61, 2413-2416. [all data]
Cox and Pilcher, 1970
Cox, J.D.; Pilcher, G.,
Thermochemistry of Organic and Organometallic Compounds, Academic Press, New York, 1970, 1-636. [all data]
Rozhnov and Andreevskii, 1962
Rozhnov, A.M.; Andreevskii, D.N.,
Equilibrium in the system propene, hydrogen bromide, bromopropane,
Dokl. Akad. Nauk SSSR, 1962, 147, 388-391. [all data]
Bjellerup, 1961
Bjellerup, L.,
On the accuracy of heat of combustion data obtained with a precision moving-bomb calorimetric method for organic bromine compounds,
Acta Chem. Scand., 1961, 15, 121-140. [all data]
Holm, 1973
Holm, T.,
Thermochemistry of Grignard reagents. Enthalpies of formation of alkylmagnesium bromides and of alkyl bromides,
J. Organomet. Chem., 1973, 56, 87-93. [all data]
Shehatta, 1993
Shehatta, I.,
Heat capacity at constant pressure of some halogen compounds,
Thermochim. Acta, 1993, 213, 1-10. [all data]
Kushner, Crowe, et al., 1950
Kushner, L.M.; Crowe, R.W.; Smyth, C.P.,
The heat capacities and dielectric constants of some alkyl halides in the solid state,
J. Am. Chem. Soc., 1950, 72, 1091-1098. [all data]
von Reis, 1881
von Reis, M.A.,
Die specifische Wärme flüssiger organischer Verbindungen und ihre Beziehung zu deren Moleculargewicht,
Ann. Physik [3], 1881, 13, 447-464. [all data]
Kushner, Crowe, et al., 1950, 2
Kushner, L.M.; Crowe, R.W.; Smyth, C.P.,
The Heat Capacity and Dielectric Constants of Some Alkyl Halides in the Solid State,
J. Am. Chem. Soc., 1950, 72, 1091. [all data]
Timmermans, 1921
Timmermans, J.,
The Freezing Points of Organic Substances IV. New Exp. Determinations,
Bull. Soc. Chim. Belg., 1921, 30, 62. [all data]
Majer and Svoboda, 1985
Majer, V.; Svoboda, V.,
Enthalpies of Vaporization of Organic Compounds: A Critical Review and Data Compilation, Blackwell Scientific Publications, Oxford, 1985, 300. [all data]
Chickos, Hosseini, et al., 1995
Chickos, James S.; Hosseini, Sarah; Hesse, Donald G.,
Determination of vaporization enthalpies of simple organic molecules by correlations of changes in gas chromatographic net retention times,
Thermochimica Acta, 1995, 249, 41-62, https://doi.org/10.1016/0040-6031(95)90670-3
. [all data]
Wadsö, Murto, et al., 1966
Wadsö, Ingemar; Murto, Maija-Leena; Bergson, Göran; Ehrenberg, L.; Brunvoll, J.; Bunnenberg, E.; Djerassi, Carl; Records, Ruth,
Heats of Vaporization for a Number of Organic Compounds at 25 degrees C.,
Acta Chem. Scand., 1966, 20, 544-552, https://doi.org/10.3891/acta.chem.scand.20-0544
. [all data]
Wadso, 1966
Wadso, I.,
Acta Chem. Scand., 1966, 20, 544. [all data]
Stephenson and Malanowski, 1987
Stephenson, Richard M.; Malanowski, Stanislaw,
Handbook of the Thermodynamics of Organic Compounds, 1987, https://doi.org/10.1007/978-94-009-3173-2
. [all data]
Svoboda, Majer, et al., 1977
Svoboda, V.; Majer, V.; Veselý, F.; Pick, J.,
Heats of vaporization of alkyl bromides,
Collect. Czech. Chem. Commun., 1977, 42, 6, 1755-1760, https://doi.org/10.1135/cccc19771755
. [all data]
Stull, 1947
Stull, Daniel R.,
Vapor Pressure of Pure Substances. Organic and Inorganic Compounds,
Ind. Eng. Chem., 1947, 39, 4, 517-540, https://doi.org/10.1021/ie50448a022
. [all data]
Mathews and Fehlandt, 1931
Mathews, J.H.; Fehlandt, P.R.,
The heats of vaporization of some organic compounds,
J. Am. Chem. Soc., 1931, 53, 3212-32. [all data]
Rex, 1906
Rex, A.,
Z. Phys. Chem., Stoechiom. Verwandtschaftsl., 1906, 55, 355. [all data]
Boublik, Fried, et al., 1984
Boublik, T.; Fried, V.; Hala, E.,
The Vapour Pressures of Pure Substances: Selected Values of the Temperature Dependence of the Vapour Pressures of Some Pure Substances in the Normal and Low Pressure Region, 2nd ed., Elsevier, New York, 1984, 972. [all data]
Rex, 1906, 2
Rex, A.,
Uber die Loslichkeit der Halogenderivate der Kohlenwasserstoffe in Wasser,
Z. Phys. Chem. (Frankfurt/Main), 1906, 55, 355-370. [all data]
Domalski and Hearing, 1996
Domalski, Eugene S.; Hearing, Elizabeth D.,
Heat Capacities and Entropies of Organic Compounds in the Condensed Phase. Volume III,
J. Phys. Chem. Ref. Data, 1996, 25, 1, 1, https://doi.org/10.1063/1.555985
. [all data]
Lacher, Kianpour, et al., 1957
Lacher, J.R.; Kianpour, A.; Park, J.D.,
Reaction heats of organic halogen compounds. X. Vapor phase heats of hydrobromination of cyclopropane and propylene,
J. Phys. Chem., 1957, 61, 1124-1125. [all data]
Lacher, Lea, et al., 1950
Lacher, J.R.; Lea, K.R.; Walden, C.H.; Olson, G.G.; Park, J.D.,
Reaction heats of organic fluorine compounds. III. The vapor phase heats of hydrobromination of some simple fluoroolefins,
J. Am. Chem. Soc., 1950, 72, 3231-3234. [all data]
Lacher, Walden, et al., 1950
Lacher, J.R.; Walden, C.H.; Lea, K.R.; Park, J.D.,
Vapor phase heats of hydrobromination of cyclopropane and propylene,
J. Am. Chem. Soc., 1950, 72, 331-333. [all data]
Li, Ross, et al., 1996
Li, C.; Ross, P.; Szulejko, J.; McMahon, T.B.,
High-Pressure Mass Spectrometric Investigations of the Potential Energy Surfaces of Gas-Phase Sn2 Reactions.,
J. Am. Chem. Soc., 1996, 118, 39, 9360, https://doi.org/10.1021/ja960565o
. [all data]
Dougherty, 1974
Dougherty, R.C.,
SN2 reactions in the gas phase. Alkyl group structural effects,
Org. Mass Spectrom., 1974, 8, 85. [all data]
Alenin, Rozhnov, et al., 1974
Alenin, V.I.; Rozhnov, A.M.; Nesterova, T.N.; Strizhkov, V.N.,
Equilibrium in the isomerisation of liquid C3-C4 monobromoalkanes,
Russ. J. Phys. Chem. (Engl. Transl.), 1974, 48, 1702. [all data]
Rozhnov and Andreevskii, 1964
Rozhnov, A.M.; Andreevskii, D.N.,
Isomerization of bromopropane,
Neftekhimiya, 1964, 4, 111-118. [all data]
Mayo and Dolnick, 1944
Mayo, F.R.; Dolnick, A.A.,
Rearrangement of alkyl halides,
J. Am. Chem. Soc., 1944, 66, 985-990. [all data]
Staley and Beauchamp, 1975
Staley, R.H.; Beauchamp, J.L.,
Intrinsic Acid - Base Properties of Molecules. Binding Energies of Li+ to pi - and n - Donor Bases,
J. Am. Chem. Soc., 1975, 97, 20, 5920, https://doi.org/10.1021/ja00853a050
. [all data]
Dzidic and Kebarle, 1970
Dzidic, I.; Kebarle, P.,
Hydration of the Alkali Ions in the Gas Phase. Enthalpies and Entropies of Reactions M+(H2O)n-1 + H2O = M+(H2O)n,
J. Phys. Chem., 1970, 74, 7, 1466, https://doi.org/10.1021/j100702a013
. [all data]
Luo and Pacey, 1992
Luo, Y.-R.; Pacey, P.D.,
Effects of alkyl substitution on ionization energies of alkanes and haloalkanes and on heats of formation of their molecular cations. Part 2. Alkanes and chloro-, bromo- and iodoalkanes,
Int. J. Mass Spectrom. Ion Processes, 1992, 112, 63. [all data]
Kimura, Katsumata, et al., 1981
Kimura, K.; Katsumata, S.; Achiba, Y.; Yamazaki, T.; Iwata, S.,
Ionization energies, Ab initio assignments, and valence electronic structure for 200 molecules
in Handbook of HeI Photoelectron Spectra of Fundamental Organic Compounds, Japan Scientific Soc. Press, Tokyo, 1981. [all data]
Traeger, 1980
Traeger, J.C.,
Photoionization mass spectrometry of the propyl halides,
Int. J. Mass Spectrom. Ion Phys., 1980, 32, 309. [all data]
Gross, 1972
Gross, M.L.,
Ion cyclotron resonance spectrometry. A means of evaluating 'kinetic shifts',
Org. Mass Spectrom., 1972, 6, 827. [all data]
Hashmall and Heilbronner, 1970
Hashmall, J.A.; Heilbronner, E.,
n-Ionization potentials of alkyl bromides,
Angew. Chem. Intern. Ed., 1970, 9, 305. [all data]
Watanabe, Nakayama, et al., 1962
Watanabe, K.; Nakayama, T.; Mottl, J.,
Ionization potentials of some molecules,
J. Quant. Spectry. Radiative Transfer, 1962, 2, 369. [all data]
Holmes and Osborne, 1978
Holmes, J.L.; Osborne, A.D.,
Energy partitioning in the metastable fragmentation [C3H7]+ → [C3H5]+ + H2,
Org. Mass Spectrom., 1978, 13, 133. [all data]
Rosenstock, Buff, et al., 1982
Rosenstock, H.M.; Buff, R.; Ferreira, M.A.A.; Lias, S.G.; Parr, A.C.; Stockbauer, R.L.; Holmes, J.L.,
Fragmentation mechanism and energetics of some alkyl halide ions,
J. Am. Chem. Soc., 1982, 104, 2337. [all data]