cis-Perfluorobicyclo[4.3.0]nonane

Phase change data

Data compiled as indicated in comments:
ALS - Hussein Y. Afeefy, Joel F. Liebman, and Stephen E. Stein
AC - William E. Acree, Jr., James S. Chickos

Quantity Value Units Method Reference Comment
Δvap41.4 ± 0.14kJ/molEZhogina, Papina, et al., 1988ALS

Enthalpy of fusion

ΔfusH (kJ/mol) Temperature (K) Method Reference Comment
2.72291.3ACVarushchenko and Druzhinina, 1998Based on data from 5. - 350. K.; AC

Gas phase thermochemistry data

Data compiled by: Hussein Y. Afeefy, Joel F. Liebman, and Stephen E. Stein

Quantity Value Units Method Reference Comment
Δfgas-767.7 ± 1.3kcal/molCcrZhogina, Papina, et al., 1988

References

Zhogina, Papina, et al., 1988
Zhogina, E.V.; Papina, T.S.; Kolesov, V.P.; Prokudin, I.P.; Mel'nichenko, B.A., Standard enthalpy of formation of cis-Perfluorobicyclo[4.3.0]nonane, Russ. J. Phys. Chem. (Engl. Transl.), 1988, 62, 1004. [all data]

Varushchenko and Druzhinina, 1998
Varushchenko, R.M.; Druzhinina, A.I., Low-temperature calorimetric studies ofcis- andtrans-perfluorobicyclo(4,3,0)nonanes, The Journal of Chemical Thermodynamics, 1998, 30, 6, 697-708, https://doi.org/10.1006/jcht.1997.0336 . [all data]