Anisole, p(α-chloro-p-methylbenzyl)-

Reaction thermochemistry data

Data compiled by: Hussein Y. Afeefy, Joel F. Liebman, and Stephen E. Stein

Individual Reactions

Anisole, p(α-chloro-p-methylbenzyl)- + 1-Pentene, 2-methyl- = C21H27ClO

By formula: C15H15ClO + C6H12 = C21H27ClO

Quantity Value Units Method Reference Comment
Δr-83.5 ± 5.7kJ/molCmSchade, Mayr, et al., 1988liquid phase; solvent: Methylene chloride

References

Schade, Mayr, et al., 1988
Schade, C.; Mayr, H.; Arnett, E.M., Thermochemical study of the addition of carbenium ions to alkenes, J. Am. Chem. Soc., 1988, 110, 567-571. [all data]