(Z) 3,4-Di-tert-butyl-3-hexene

Reaction thermochemistry data

Data compiled by: Hussein Y. Afeefy, Joel F. Liebman, and Stephen E. Stein

Individual Reactions

(Z) 3,4-Di-tert-butyl-3-hexene = (E)-3,4-Di-tert-butyl-3-hexene

By formula: C14H28 = C14H28

Quantity Value Units Method Reference Comment
Δr-28. ± 0.8kJ/molEqkDoering, Roth, et al., 1989gas phase

References

Doering, Roth, et al., 1989
Doering, W.E.; Roth, W.R.; Bauer, F.; Breuckmann, R.; Ebbrecht, T.; Herbold, M.; Schmidt, R.; Lennartz, H-W.; Lenoir, D.; Boese, R., Rotational barriers of strained olefines, Chem. Ber., 1989, 122, 1263-1266. [all data]