Trimethylamine, compd. with borane (1:1)

Condensed phase thermochemistry data

Data compiled by: Eugene S. Domalski and Elizabeth D. Hearing

Quantity Value Units Method Reference Comment
solid,1 bar169.58J/mol*KN/AFinke, Todd, et al., 1970crystaline, III phase

Constant pressure heat capacity of solid

Cp,solid (J/mol*K) Temperature (K) Reference Comment
173.76298.15Finke, Todd, et al., 1970crystaline, III phase; T = 12 to 390 K.

Phase change data

Data compiled as indicated in comments:
TRC - Thermodynamics Research Center, NIST Boulder Laboratories, Chris Muzny director
AC - William E. Acree, Jr., James S. Chickos
DH - Eugene S. Domalski and Elizabeth D. Hearing

Quantity Value Units Method Reference Comment
Ttriple368.70KN/AFinke, Todd, et al., 1970, 2Crystal phase 1 phase; Uncertainty assigned by TRC = 0.02 K; TRC

Antoine Equation Parameters

log10(P) = A − (B / (T + C))
    P = vapor pressure (bar)
    T = temperature (K)

View plot Requires a JavaScript / HTML 5 canvas capable browser.

Temperature (K) A B C Reference Comment
136. - 194.34.33875826.224-19.27Burg and Schlesinger, 1937Coefficents calculated by NIST from author's data.

Enthalpy of sublimation

ΔsubH (kJ/mol) Temperature (K) Method Reference Comment
57.0311.AStephenson and Malanowski, 1987Based on data from 296. - 367. K. See also Burg and Schlesinger, 1937.; AC
56.9 ± 0.8273. - 363.MEAlton, Brown, et al., 1959AC

Enthalpy of phase transition

ΔHtrs (kJ/mol) Temperature (K) Initial Phase Final Phase Reference Comment
2.535350.1crystaline, IIIcrystaline, IIFinke, Todd, et al., 1970DH
0.594360.4crystaline, IIcrystaline, IFinke, Todd, et al., 1970DH
4.9472368.70crystaline, IliquidFinke, Todd, et al., 1970DH

Entropy of phase transition

ΔStrs (J/mol*K) Temperature (K) Initial Phase Final Phase Reference Comment
7.24350.1crystaline, IIIcrystaline, IIFinke, Todd, et al., 1970DH
16.48360.4crystaline, IIcrystaline, IFinke, Todd, et al., 1970DH
13.42368.70crystaline, IliquidFinke, Todd, et al., 1970DH

In addition to the Thermodynamics Research Center (TRC) data available from this site, much more physical and chemical property data is available from the following TRC products:

Reaction thermochemistry data

Data compiled by: John E. Bartmess

Individual Reactions

C3H11BN- + Hydrogen cation = Trimethylamine, compd. with borane (1:1)

By formula: C3H11BN- + H+ = C3H12BN

Quantity Value Units Method Reference Comment
Δr1645. ± 8.8kJ/molG+TSRen, Workman, et al., 1998gas phase; Acid heat est. from B-N bond strength of "35-40 kcal/mol" in Ren, Workman, et al., 1998
Quantity Value Units Method Reference Comment
Δr1607. ± 8.4kJ/molIMRBRen, Workman, et al., 1998gas phase; Acid heat est. from B-N bond strength of "35-40 kcal/mol" in Ren, Workman, et al., 1998

References

Finke, Todd, et al., 1970
Finke, H.L.; Todd, S.S.; Messerly, J.F., Trimethylamineborane and triethylamineborane: low-temperature thermodynamic properties, J. Chem. Thermodynam., 1970, 2, 129-138. [all data]

Finke, Todd, et al., 1970, 2
Finke, H.L.; Todd, S.S.; Messerly, J.F., Trimethylamineborane and Triethylamineborane: Low-temperature Thermodynamic Properties, J. Chem. Thermodyn., 1970, 2, 129. [all data]

Burg and Schlesinger, 1937
Burg, Anton B.; Schlesinger, H.I., Hydrides of Boron. VII. Evidence of the Transitory Existence of Borine (BH 3 ): Borine Carbonyl and Borine Trimethylammine, J. Am. Chem. Soc., 1937, 59, 5, 780-787, https://doi.org/10.1021/ja01284a002 . [all data]

Stephenson and Malanowski, 1987
Stephenson, Richard M.; Malanowski, Stanislaw, Handbook of the Thermodynamics of Organic Compounds, 1987, https://doi.org/10.1007/978-94-009-3173-2 . [all data]

Alton, Brown, et al., 1959
Alton, E.R.; Brown, R.D.; Carter, J.C.; Taylor, R.C., Vapor Pressures of the Methylamine-Boranes and Ammonia-Triborane 1, J. Am. Chem. Soc., 1959, 81, 14, 3550-3551, https://doi.org/10.1021/ja01523a016 . [all data]

Ren, Workman, et al., 1998
Ren, J.H.; Workman, D.B.; Squires, R.R., Gas-phase negative ion chemistry of Lewis acid-base complexes, J. Am. Chem. Soc., 1998, 120, 40, 10511-10522, https://doi.org/10.1021/ja9804518 . [all data]