Tetracyclo[5.3.0.02,6.03,10]dec-4-ene

Gas phase ion energetics data

Data compiled by: Sharon G. Lias, Rhoda D. Levin, and Sherif A. Kafafi

Ionization energy determinations

IE (eV) Method Reference Comment
8.72PESpanget-Larsen, Gleiter, et al., 1980Vertical value

References

Spanget-Larsen, Gleiter, et al., 1980
Spanget-Larsen, J.; Gleiter, R.; Klein, G.; Doecke, C.W.; Paquette, L.A., Orbital interactions in "hypostrophene" and its hydro- and homo-derivatives. A photoelectron spectroscopic investigation, Chem. Ber., 1980, 113, 2120. [all data]